BDBM50414887 CHEMBL574209
SMILES: COc1cc-2c(Cc3c(NCc4c(C)cccc4Cl)[nH]nc-23)c(OC)c1
InChI Key: InChIKey=CIPGTFNQXYGVFJ-UHFFFAOYSA-N
Data: 1 IC50
Activity Spreadsheet -- Enzyme Inhibition Constant Data from BindingDB
Found 1 hit for monomerid = 50414887
Trg + Lig
Ki
nM
ΔG°
kcal/mole
IC50
nM
Kd
nM
EC50/IC50
nM
koff
s-1
kon
M-1s-1
pHTemp
°C
Eukaryotic translation initiation factor 2-alpha kinase 1
(Homo sapiens (Human))
BDBM50414887
(CHEMBL574209)
Show SMILES COc1cc-2c(Cc3c(NCc4c(C)cccc4Cl)[nH]nc-23)c(OC)c1
Show InChI InChI=1S/C20H20ClN3O2/c1-11-5-4-6-17(21)16(11)10-22-20-15-9-13-14(19(15)23-24-20)7-12(25-2)8-18(13)26-3/h4-8H,9-10H2,1-3H3,(H2,22,23,24)
n/an/a 126n/an/an/an/an/an/a
Johnson& Johnson Pharmaceutical Research and Development
Curated by ChEMBL
Assay Description
Inhibition of human HRI kinase
Bioorg Med Chem Lett 19: 6548-51 (2009)
Article DOI: 10.1016/j.bmcl.2009.10.033
BindingDB Entry DOI: 10.7270/Q26Q1ZGZ