BDBM50414983 CHEMBL574655
SMILES: COc1ccccc1Oc1cccc(CN2CCC3(CC2)CCN(CC3)C(=O)c2ccncn2)c1
InChI Key: InChIKey=DDUAZQDCAKMWPF-UHFFFAOYSA-N
Data: 2 IC50
Activity Spreadsheet -- Enzyme Inhibition Constant Data from BindingDB
Found 2 hits for monomerid = 50414983
Trg + Lig
Ki
nM
ΔG°
kcal/mole
IC50
nM
Kd
nM
EC50/IC50
nM
koff
s-1
kon
M-1s-1
pHTemp
°C
C-C chemokine receptor type 8
(Homo sapiens (Human))
BDBM50414983
(CHEMBL574655)
Show SMILES COc1ccccc1Oc1cccc(CN2CCC3(CC2)CCN(CC3)C(=O)c2ccncn2)c1
Show InChI InChI=1S/C28H32N4O3/c1-34-25-7-2-3-8-26(25)35-23-6-4-5-22(19-23)20-31-15-10-28(11-16-31)12-17-32(18-13-28)27(33)24-9-14-29-21-30-24/h2-9,14,19,21H,10-13,15-18,20H2,1H3
Reactome pathway
n/an/a 4.90n/an/an/an/an/an/a
AstraZeneca
Curated by ChEMBL
Assay Description
Antagonist activity at human CCR8
J Med Chem 52: 7706-23 (2009)
Article DOI: 10.1021/jm900713y
BindingDB Entry DOI: 10.7270/Q2TH8NZP
Potassium voltage-gated channel subfamily H member 2
(Homo sapiens (Human))
BDBM50414983
(CHEMBL574655)
Show SMILES COc1ccccc1Oc1cccc(CN2CCC3(CC2)CCN(CC3)C(=O)c2ccncn2)c1
Show InChI InChI=1S/C28H32N4O3/c1-34-25-7-2-3-8-26(25)35-23-6-4-5-22(19-23)20-31-15-10-28(11-16-31)12-17-32(18-13-28)27(33)24-9-14-29-21-30-24/h2-9,14,19,21H,10-13,15-18,20H2,1H3
Reactome pathway
n/an/a 1.91E+3n/an/an/an/an/an/a
AstraZeneca
Curated by ChEMBL
Assay Description
Inhibition of wild type human ERG expressed in CHOK1 cells by whole-cell plate-based electrophysiology
J Med Chem 52: 7706-23 (2009)
Article DOI: 10.1021/jm900713y
BindingDB Entry DOI: 10.7270/Q2TH8NZP