null
SMILES: COc1cccc(Nc2c(cnc3ccc(cc23)S(=O)(=O)N(C)C)C(N)=O)c1
InChI Key: InChIKey=WKVXXUZTBQURHS-UHFFFAOYSA-N
Activity Spreadsheet -- Enzyme Inhibition Constant Data from BindingDB
Found 1 hit for monomerid = 50414992
Trg + Lig
Ki
nM
ΔG°
kcal/mole
IC50
nM
Kd
nM
EC50/IC50
nM
koff
s-1
kon
M-1s-1
pHTemp
°C
cAMP-specific 3',5'-cyclic phosphodiesterase 4B
(Homo sapiens (Human))
BDBM50414992
(CHEMBL576479)
Show SMILES COc1cccc(Nc2c(cnc3ccc(cc23)S(=O)(=O)N(C)C)C(N)=O)c1
Show InChI InChI=1S/C19H20N4O4S/c1-23(2)28(25,26)14-7-8-17-15(10-14)18(16(11-21-17)19(20)24)22-12-5-4-6-13(9-12)27-3/h4-11H,1-3H3,(H2,20,24)(H,21,22)
n/an/a 0.794n/an/an/an/an/an/a
GlaxoSmithKline Medicines Research Centre
Curated by ChEMBL
Assay Description
Inhibition of human recombinant PDE4B by scintillation proximity assay
Bioorg Med Chem Lett 19: 5261-5 (2009)
Article DOI: 10.1016/j.bmcl.2009.04.012
BindingDB Entry DOI: 10.7270/Q2K075HB