null
SMILES: Cc1coc2CCCC(Nc3c(cnc4ccc(cc34)S(=O)(=O)c3ccccc3)C(N)=O)c12
InChI Key: InChIKey=WAKRKTFHBVTZPF-UHFFFAOYSA-N
Activity Spreadsheet -- Enzyme Inhibition Constant Data from BindingDB
Found 1 hit for monomerid = 50414997
Trg + Lig
Ki
nM
ΔG°
kcal/mole
IC50
nM
Kd
nM
EC50/IC50
nM
koff
s-1
kon
M-1s-1
pHTemp
°C
cAMP-specific 3',5'-cyclic phosphodiesterase 4B
(Homo sapiens (Human))
BDBM50414997
(CHEMBL569555)
Show SMILES Cc1coc2CCCC(Nc3c(cnc4ccc(cc34)S(=O)(=O)c3ccccc3)C(N)=O)c12
Show InChI InChI=1S/C25H23N3O4S/c1-15-14-32-22-9-5-8-21(23(15)22)28-24-18-12-17(33(30,31)16-6-3-2-4-7-16)10-11-20(18)27-13-19(24)25(26)29/h2-4,6-7,10-14,21H,5,8-9H2,1H3,(H2,26,29)(H,27,28)
n/an/a 12.6n/an/an/an/an/an/a
GlaxoSmithKline Medicines Research Centre
Curated by ChEMBL
Assay Description
Inhibition of human recombinant PDE4B by scintillation proximity assay
Bioorg Med Chem Lett 19: 5261-5 (2009)
Article DOI: 10.1016/j.bmcl.2009.04.012
BindingDB Entry DOI: 10.7270/Q2K075HB