null
SMILES: COc1cccc(Nc2c(cnc3ccc(cc23)S(=O)(=O)N2CCOCC2)C(N)=O)c1
InChI Key: InChIKey=ZHTPYDHRVLKBDQ-UHFFFAOYSA-N
Activity Spreadsheet -- Enzyme Inhibition Constant Data from BindingDB
Found 1 hit for monomerid = 50415004
Trg + Lig
Ki
nM
ΔG°
kcal/mole
IC50
nM
Kd
nM
EC50/IC50
nM
koff
s-1
kon
M-1s-1
pHTemp
°C
cAMP-specific 3',5'-cyclic phosphodiesterase 4B
(Homo sapiens (Human))
BDBM50415004
(CHEMBL571593)
Show SMILES COc1cccc(Nc2c(cnc3ccc(cc23)S(=O)(=O)N2CCOCC2)C(N)=O)c1
Show InChI InChI=1S/C21H22N4O5S/c1-29-15-4-2-3-14(11-15)24-20-17-12-16(31(27,28)25-7-9-30-10-8-25)5-6-19(17)23-13-18(20)21(22)26/h2-6,11-13H,7-10H2,1H3,(H2,22,26)(H,23,24)
n/an/a 2n/an/an/an/an/an/a
GlaxoSmithKline Medicines Research Centre
Curated by ChEMBL
Assay Description
Inhibition of human recombinant PDE4B by scintillation proximity assay
Bioorg Med Chem Lett 19: 5261-5 (2009)
Article DOI: 10.1016/j.bmcl.2009.04.012
BindingDB Entry DOI: 10.7270/Q2K075HB