BDBM50415094 CHEMBL578199
SMILES: OC1(C[C@H]2CC[C@H](C1)N2c1ccc(C#N)c2ccccc12)C=C
InChI Key: InChIKey=MOFYENQTLGJEFW-HZPDHXFCSA-N
Data: 1 EC50
Activity Spreadsheet -- Enzyme Inhibition Constant Data from BindingDB
Found 1 hit for monomerid = 50415094
Trg + Lig
Ki
nM
ΔG°
kcal/mole
IC50
nM
Kd
nM
EC50/IC50
nM
koff
s-1
kon
M-1s-1
pHTemp
°C
Androgen Receptor
(Mus musculus)
BDBM50415094
(CHEMBL578199)
Show SMILES OC1(C[C@H]2CC[C@H](C1)N2c1ccc(C#N)c2ccccc12)C=C |r,TLB:0:1:8:4.5,9:8:1.2.7:4.5,THB:21:1:8:4.5|
Show InChI InChI=1S/C20H20N2O/c1-2-20(23)11-15-8-9-16(12-20)22(15)19-10-7-14(13-21)17-5-3-4-6-18(17)19/h2-7,10,15-16,23H,1,8-9,11-12H2/t15-,16-/m1/s1
Reactome pathway
n/an/an/an/a 2n/an/an/an/a
ACADIA Pharmaceuticals AB
Curated by ChEMBL
Assay Description
Agonist activity at androgen receptor in mouse NIH3T3 cells transiently transfected with beta-galactosidase reporter gene assessed as cellular transf...
J Med Chem 52: 7186-91 (2009)
Article DOI: 10.1021/jm901149c
BindingDB Entry DOI: 10.7270/Q2SJ1MV9