BDBM50415095 CHEMBL568786
SMILES: CC1(O)C[C@H]2CC[C@H](C1)N2c1ccc(C#N)c2ccccc12
InChI Key: InChIKey=XYPBJIBUDRIKSD-HUUCEWRRSA-N
Data: 1 EC50
Activity Spreadsheet -- Enzyme Inhibition Constant Data from BindingDB
Found 1 hit for monomerid = 50415095
Trg + Lig
Ki
nM
ΔG°
kcal/mole
IC50
nM
Kd
nM
EC50/IC50
nM
koff
s-1
kon
M-1s-1
pHTemp
°C
Androgen Receptor
(Mus musculus)
BDBM50415095
(CHEMBL568786)
Show SMILES CC1(O)C[C@H]2CC[C@H](C1)N2c1ccc(C#N)c2ccccc12 |r,TLB:2:1:9:5.6,10:9:1.3.8:5.6,THB:0:1:9:5.6|
Show InChI InChI=1S/C19H20N2O/c1-19(22)10-14-7-8-15(11-19)21(14)18-9-6-13(12-20)16-4-2-3-5-17(16)18/h2-6,9,14-15,22H,7-8,10-11H2,1H3/t14-,15-/m1/s1
Reactome pathway
n/an/an/an/a 2n/an/an/an/a
ACADIA Pharmaceuticals AB
Curated by ChEMBL
Assay Description
Agonist activity at androgen receptor in mouse NIH3T3 cells transiently transfected with beta-galactosidase reporter gene assessed as cellular transf...
J Med Chem 52: 7186-91 (2009)
Article DOI: 10.1021/jm901149c
BindingDB Entry DOI: 10.7270/Q2SJ1MV9