null
SMILES: CC(C)C1(O)C[C@H]2CC[C@H](C1)N2c1ccc(C#N)c2ccccc12
InChI Key: InChIKey=LHEMVXVTFBTVBC-IAGOWNOFSA-N
Activity Spreadsheet -- Enzyme Inhibition Constant Data from BindingDB
Found 1 hit for monomerid = 50415100
Trg + Lig
Ki
nM
ΔG°
kcal/mole
IC50
nM
Kd
nM
EC50/IC50
nM
koff
s-1
kon
M-1s-1
pHTemp
°C
Androgen receptor
(Mus musculus)
BDBM50415100
(CHEMBL570413)
Show SMILES CC(C)C1(O)C[C@H]2CC[C@H](C1)N2c1ccc(C#N)c2ccccc12 |r,TLB:4:3:11:7.8,12:11:3.5.10:7.8,THB:1:3:11:7.8|
Show InChI InChI=1S/C21H24N2O/c1-14(2)21(24)11-16-8-9-17(12-21)23(16)20-10-7-15(13-22)18-5-3-4-6-19(18)20/h3-7,10,14,16-17,24H,8-9,11-12H2,1-2H3/t16-,17-/m1/s1
Reactome pathway
n/an/an/an/a 5.01n/an/an/an/a
ACADIA Pharmaceuticals AB
Curated by ChEMBL
Assay Description
Agonist activity at androgen receptor in mouse NIH3T3 cells transiently transfected with beta-galactosidase reporter gene assessed as cellular transf...
J Med Chem 52: 7186-91 (2009)
Article DOI: 10.1021/jm901149c
BindingDB Entry DOI: 10.7270/Q2SJ1MV9