null
SMILES: Fc1cccc(c1F)-c1ccc(nc1)N1CCOCC1
InChI Key: InChIKey=AFOUIDYNAJCSAP-UHFFFAOYSA-N
Activity Spreadsheet -- Enzyme Inhibition Constant Data from BindingDB
Found 1 hit for monomerid = 50415120
Trg + Lig
Ki
nM
ΔG°
kcal/mole
IC50
nM
Kd
nM
EC50/IC50
nM
koff
s-1
kon
M-1s-1
pHTemp
°C
Cannabinoid receptor 2
(Homo sapiens (Human))
BDBM50415120
(CHEMBL576709)
Show SMILES Fc1cccc(c1F)-c1ccc(nc1)N1CCOCC1
Show InChI InChI=1S/C15H14F2N2O/c16-13-3-1-2-12(15(13)17)11-4-5-14(18-10-11)19-6-8-20-9-7-19/h1-5,10H,6-9H2
Reactome pathway
n/an/an/an/a 251n/an/an/an/a
GlaxoSmithKline
Curated by ChEMBL
Assay Description
Agonist activity at human CB2 receptor expressed in yeast cells
Bioorg Med Chem Lett 19: 6578-81 (2009)
Article DOI: 10.1016/j.bmcl.2009.10.041
BindingDB Entry DOI: 10.7270/Q2NS0W40