null
SMILES: Clc1cccc(c1Cl)-c1ccc(nn1)N1CCOCC1
InChI Key: InChIKey=KSGZMUZDZVQSJS-UHFFFAOYSA-N
Activity Spreadsheet -- Enzyme Inhibition Constant Data from BindingDB
Found 2 hits for monomerid = 50415303
Trg + Lig
Ki
nM
ΔG°
kcal/mole
IC50
nM
Kd
nM
EC50/IC50
nM
koff
s-1
kon
M-1s-1
pHTemp
°C
Cannabinoid receptor 1
(Homo sapiens (Human))
BDBM50415303
(CHEMBL594977)
Show SMILES Clc1cccc(c1Cl)-c1ccc(nn1)N1CCOCC1
Show InChI InChI=1S/C14H13Cl2N3O/c15-11-3-1-2-10(14(11)16)12-4-5-13(18-17-12)19-6-8-20-9-7-19/h1-5H,6-9H2
NCI pathway
Reactome pathway
n/an/an/an/a>3.16E+4n/an/an/an/a
GlaxoSmithKline
Curated by ChEMBL
Assay Description
Agonist activity at human CB1 receptor
Bioorg Med Chem Lett 20: 465-8 (2010)
Article DOI: 10.1016/j.bmcl.2009.11.117
BindingDB Entry DOI: 10.7270/Q27M096D
Cannabinoid receptor 2
(Homo sapiens (Human))
BDBM50415303
(CHEMBL594977)
Show SMILES Clc1cccc(c1Cl)-c1ccc(nn1)N1CCOCC1
Show InChI InChI=1S/C14H13Cl2N3O/c15-11-3-1-2-10(14(11)16)12-4-5-13(18-17-12)19-6-8-20-9-7-19/h1-5H,6-9H2
Reactome pathway
n/an/an/an/a 79.4n/an/an/an/a
GlaxoSmithKline
Curated by ChEMBL
Assay Description
Agonist activity at human CB2 receptor
Bioorg Med Chem Lett 20: 465-8 (2010)
Article DOI: 10.1016/j.bmcl.2009.11.117
BindingDB Entry DOI: 10.7270/Q27M096D