null
SMILES: FC1(F)CCN(CC1)c1ccc(nn1)-c1cccc(Cl)c1Cl
InChI Key: InChIKey=JLPIEEHZSKZBJT-UHFFFAOYSA-N
Activity Spreadsheet -- Enzyme Inhibition Constant Data from BindingDB
Found 2 hits for monomerid = 50415308
Trg + Lig
Ki
nM
ΔG°
kcal/mole
IC50
nM
Kd
nM
EC50/IC50
nM
koff
s-1
kon
M-1s-1
pHTemp
°C
Cannabinoid receptor 1
(Homo sapiens (Human))
BDBM50415308
(CHEMBL594837)
Show SMILES FC1(F)CCN(CC1)c1ccc(nn1)-c1cccc(Cl)c1Cl
Show InChI InChI=1S/C15H13Cl2F2N3/c16-11-3-1-2-10(14(11)17)12-4-5-13(21-20-12)22-8-6-15(18,19)7-9-22/h1-5H,6-9H2
NCI pathway
Reactome pathway
n/an/an/an/a>3.16E+4n/an/an/an/a
GlaxoSmithKline
Curated by ChEMBL
Assay Description
Agonist activity at human CB1 receptor
Bioorg Med Chem Lett 20: 465-8 (2010)
Article DOI: 10.1016/j.bmcl.2009.11.117
BindingDB Entry DOI: 10.7270/Q27M096D
Cannabinoid receptor 2
(Homo sapiens (Human))
BDBM50415308
(CHEMBL594837)
Show SMILES FC1(F)CCN(CC1)c1ccc(nn1)-c1cccc(Cl)c1Cl
Show InChI InChI=1S/C15H13Cl2F2N3/c16-11-3-1-2-10(14(11)17)12-4-5-13(21-20-12)22-8-6-15(18,19)7-9-22/h1-5H,6-9H2
Reactome pathway
n/an/an/an/a 15.8n/an/an/an/a
GlaxoSmithKline
Curated by ChEMBL
Assay Description
Agonist activity at human CB2 receptor
Bioorg Med Chem Lett 20: 465-8 (2010)
Article DOI: 10.1016/j.bmcl.2009.11.117
BindingDB Entry DOI: 10.7270/Q27M096D