BDBM50415548 CHEMBL589509
SMILES: COc1ccc(C(=O)\C=C\c2ccccc2OCC#C)c(OC)c1
InChI Key: InChIKey=ADCQBGUGXNHEEI-FMIVXFBMSA-N
Data: 1 IC50
Activity Spreadsheet -- Enzyme Inhibition Constant Data from BindingDB
Found 1 hit for monomerid = 50415548
Trg + Lig
Ki
nM
ΔG°
kcal/mole
IC50
nM
Kd
nM
EC50/IC50
nM
koff
s-1
kon
M-1s-1
pHTemp
°C
Falcipain-2
(Plasmodium falciparum)
BDBM50415548
(CHEMBL589509)
Show SMILES COc1ccc(C(=O)\C=C\c2ccccc2OCC#C)c(OC)c1
Show InChI InChI=1S/C20H18O4/c1-4-13-24-19-8-6-5-7-15(19)9-12-18(21)17-11-10-16(22-2)14-20(17)23-3/h1,5-12,14H,13H2,2-3H3/b12-9+
n/an/a>1.00E+5n/an/an/an/an/an/a
University of Cape Town
Curated by ChEMBL
Assay Description
Inhibition of Plasmodium falciparum falcipain-2
Bioorg Med Chem Lett 20: 942-4 (2010)
Article DOI: 10.1016/j.bmcl.2009.12.062
BindingDB Entry DOI: 10.7270/Q26M383G