BDBM50415553 CHEMBL605130
SMILES: CC(CN1CCN(CC1)C(C)=O)NC(=O)c1cc2c(nn(C)c2s1)-c1ccccc1F
InChI Key: InChIKey=VEXWNKYGWUAGTB-UHFFFAOYSA-N
Data: 1 IC50
Activity Spreadsheet -- Enzyme Inhibition Constant Data from BindingDB
Found 1 hit for monomerid = 50415553
Trg + Lig
Ki
nM
ΔG°
kcal/mole
IC50
nM
Kd
nM
EC50/IC50
nM
koff
s-1
kon
M-1s-1
pHTemp
°C
P2X purinoceptor 3
(RAT)
BDBM50415553
(CHEMBL605130)
Show SMILES CC(CN1CCN(CC1)C(C)=O)NC(=O)c1cc2c(nn(C)c2s1)-c1ccccc1F
Show InChI InChI=1S/C22H26FN5O2S/c1-14(13-27-8-10-28(11-9-27)15(2)29)24-21(30)19-12-17-20(25-26(3)22(17)31-19)16-6-4-5-7-18(16)23/h4-7,12,14H,8-11,13H2,1-3H3,(H,24,30)
n/an/a 39.8n/an/an/an/an/an/a
Roche Palo Alto
Curated by ChEMBL
Assay Description
Antagonist activity at rat P2X3 receptor expressed in CHO cells
Bioorg Med Chem Lett 20: 1031-6 (2010)
Article DOI: 10.1016/j.bmcl.2009.12.044
BindingDB Entry DOI: 10.7270/Q22V2HCR