BDBM50415883 CHEMBL1095454
SMILES: Cc1nn(c(C)c1CC(=O)NCc1ccc(F)cc1Cl)-c1ccccc1
InChI Key: InChIKey=AXNDBMRMCLBYRQ-UHFFFAOYSA-N
Data: 4 IC50
Activity Spreadsheet -- Enzyme Inhibition Constant Data from BindingDB
Found 4 hits for monomerid = 50415883
Trg + Lig
Ki
nM
ΔG°
kcal/mole
IC50
nM
Kd
nM
EC50/IC50
nM
koff
s-1
kon
M-1s-1
pHTemp
°C
P2X purinoceptor 7 (P2X7)
(Rattus norvegicus (Rat))
BDBM50415883
(CHEMBL1095454)
Show SMILES Cc1nn(c(C)c1CC(=O)NCc1ccc(F)cc1Cl)-c1ccccc1
Show InChI InChI=1S/C20H19ClFN3O/c1-13-18(14(2)25(24-13)17-6-4-3-5-7-17)11-20(26)23-12-15-8-9-16(22)10-19(15)21/h3-10H,11-12H2,1-2H3,(H,23,26)
n/an/a 100n/an/an/an/an/an/a
GlaxoSmithKline
Curated by ChEMBL
Assay Description
Inhibition of rat P2X7 receptor by ethidium bromide release assay
Bioorg Med Chem Lett 20: 5080-4 (2010)
Article DOI: 10.1016/j.bmcl.2010.07.033
BindingDB Entry DOI: 10.7270/Q289173T
P2X purinoceptor 7
(Homo sapiens (Human))
BDBM50415883
(CHEMBL1095454)
Show SMILES Cc1nn(c(C)c1CC(=O)NCc1ccc(F)cc1Cl)-c1ccccc1
Show InChI InChI=1S/C20H19ClFN3O/c1-13-18(14(2)25(24-13)17-6-4-3-5-7-17)11-20(26)23-12-15-8-9-16(22)10-19(15)21/h3-10H,11-12H2,1-2H3,(H,23,26)
n/an/a 39.8n/an/an/an/an/an/a
GlaxoSmithKline
Curated by ChEMBL
Assay Description
Inhibition of human P2X7 receptor assessed as inhibition of ethidium bromide accumulation
Bioorg Med Chem Lett 20: 3161-4 (2010)
Article DOI: 10.1016/j.bmcl.2010.03.096
BindingDB Entry DOI: 10.7270/Q2W66N1B
P2X purinoceptor 7 (P2X7)
(Rattus norvegicus (Rat))
BDBM50415883
(CHEMBL1095454)
Show SMILES Cc1nn(c(C)c1CC(=O)NCc1ccc(F)cc1Cl)-c1ccccc1
Show InChI InChI=1S/C20H19ClFN3O/c1-13-18(14(2)25(24-13)17-6-4-3-5-7-17)11-20(26)23-12-15-8-9-16(22)10-19(15)21/h3-10H,11-12H2,1-2H3,(H,23,26)
n/an/a 100n/an/an/an/an/an/a
GlaxoSmithKline
Curated by ChEMBL
Assay Description
Inhibition of rat P2X7 receptor assessed as inhibition of ethidium bromide accumulation
Bioorg Med Chem Lett 20: 3161-4 (2010)
Article DOI: 10.1016/j.bmcl.2010.03.096
BindingDB Entry DOI: 10.7270/Q2W66N1B
P2X purinoceptor 7
(Homo sapiens (Human))
BDBM50415883
(CHEMBL1095454)
Show SMILES Cc1nn(c(C)c1CC(=O)NCc1ccc(F)cc1Cl)-c1ccccc1
Show InChI InChI=1S/C20H19ClFN3O/c1-13-18(14(2)25(24-13)17-6-4-3-5-7-17)11-20(26)23-12-15-8-9-16(22)10-19(15)21/h3-10H,11-12H2,1-2H3,(H,23,26)
n/an/a 39.8n/an/an/an/an/an/a
GlaxoSmithKline
Curated by ChEMBL
Assay Description
Inhibition of human P2X7 receptor by ethidium bromide release assay
Bioorg Med Chem Lett 20: 5080-4 (2010)
Article DOI: 10.1016/j.bmcl.2010.07.033
BindingDB Entry DOI: 10.7270/Q289173T