BDBM50416076 CHEMBL1086116
SMILES: CCCN(c1ccccc1)S(=O)(=O)c1ccc(-c2ccc3n(ncc3c2)-c2ccc(F)cc2)c(c1)C(F)(F)F
InChI Key: InChIKey=JWWJEENUMHZSBN-UHFFFAOYSA-N
Data: 4 IC50  1 EC50
Activity Spreadsheet -- Enzyme Inhibition Constant Data from BindingDB
Found 5 hits for monomerid = 50416076
Trg + Lig
Ki
nM
ΔG°
kcal/mole
IC50
nM
Kd
nM
EC50/IC50
nM
koff
s-1
kon
M-1s-1
pHTemp
°C
Progesterone receptor
(Homo sapiens (Human))
BDBM50416076
(CHEMBL1086116)
Show SMILES CCCN(c1ccccc1)S(=O)(=O)c1ccc(-c2ccc3n(ncc3c2)-c2ccc(F)cc2)c(c1)C(F)(F)F
Show InChI InChI=1S/C29H23F4N3O2S/c1-2-16-35(23-6-4-3-5-7-23)39(37,38)25-13-14-26(27(18-25)29(31,32)33)20-8-15-28-21(17-20)19-34-36(28)24-11-9-22(30)10-12-24/h3-15,17-19H,2,16H2,1H3
n/an/a>1.00E+4n/an/an/an/an/an/a
GlaxoSmithKline
Curated by ChEMBL
Assay Description
Binding affinity to PR
J Med Chem 53: 4531-44 (2010)
Article DOI: 10.1021/jm100447c
BindingDB Entry DOI: 10.7270/Q20003BB
Androgen receptor
(Homo sapiens (Human))
BDBM50416076
(CHEMBL1086116)
Show SMILES CCCN(c1ccccc1)S(=O)(=O)c1ccc(-c2ccc3n(ncc3c2)-c2ccc(F)cc2)c(c1)C(F)(F)F
Show InChI InChI=1S/C29H23F4N3O2S/c1-2-16-35(23-6-4-3-5-7-23)39(37,38)25-13-14-26(27(18-25)29(31,32)33)20-8-15-28-21(17-20)19-34-36(28)24-11-9-22(30)10-12-24/h3-15,17-19H,2,16H2,1H3
NCI pathway
Reactome pathway
n/an/a>1.00E+4n/an/an/an/an/an/a
GlaxoSmithKline
Curated by ChEMBL
Assay Description
Binding affinity to AR
J Med Chem 53: 4531-44 (2010)
Article DOI: 10.1021/jm100447c
BindingDB Entry DOI: 10.7270/Q20003BB
Glucocorticoid receptor
(Homo sapiens (Human))
BDBM50416076
(CHEMBL1086116)
Show SMILES CCCN(c1ccccc1)S(=O)(=O)c1ccc(-c2ccc3n(ncc3c2)-c2ccc(F)cc2)c(c1)C(F)(F)F
Show InChI InChI=1S/C29H23F4N3O2S/c1-2-16-35(23-6-4-3-5-7-23)39(37,38)25-13-14-26(27(18-25)29(31,32)33)20-8-15-28-21(17-20)19-34-36(28)24-11-9-22(30)10-12-24/h3-15,17-19H,2,16H2,1H3
n/an/a 316n/an/an/an/an/an/a
GlaxoSmithKline
Curated by ChEMBL
Assay Description
Activity at GR in human A549 cells by NF-kappaB transrepression assay
J Med Chem 53: 4531-44 (2010)
Article DOI: 10.1021/jm100447c
BindingDB Entry DOI: 10.7270/Q20003BB
Glucocorticoid receptor
(Homo sapiens (Human))
BDBM50416076
(CHEMBL1086116)
Show SMILES CCCN(c1ccccc1)S(=O)(=O)c1ccc(-c2ccc3n(ncc3c2)-c2ccc(F)cc2)c(c1)C(F)(F)F
Show InChI InChI=1S/C29H23F4N3O2S/c1-2-16-35(23-6-4-3-5-7-23)39(37,38)25-13-14-26(27(18-25)29(31,32)33)20-8-15-28-21(17-20)19-34-36(28)24-11-9-22(30)10-12-24/h3-15,17-19H,2,16H2,1H3
n/an/an/an/a 316n/an/an/an/a
GlaxoSmithKline
Curated by ChEMBL
Assay Description
Agonist activity at GR in human A549 cells transfected with luciferase gene linked to MMTV promoter assessed as luciferase transactivation activity a...
J Med Chem 53: 4531-44 (2010)
Article DOI: 10.1021/jm100447c
BindingDB Entry DOI: 10.7270/Q20003BB
Glucocorticoid receptor
(Homo sapiens (Human))
BDBM50416076
(CHEMBL1086116)
Show SMILES CCCN(c1ccccc1)S(=O)(=O)c1ccc(-c2ccc3n(ncc3c2)-c2ccc(F)cc2)c(c1)C(F)(F)F
Show InChI InChI=1S/C29H23F4N3O2S/c1-2-16-35(23-6-4-3-5-7-23)39(37,38)25-13-14-26(27(18-25)29(31,32)33)20-8-15-28-21(17-20)19-34-36(28)24-11-9-22(30)10-12-24/h3-15,17-19H,2,16H2,1H3
n/an/a 15.8n/an/an/an/an/an/a
GlaxoSmithKline
Curated by ChEMBL
Assay Description
Displacement of fluorescent-labeled Dexamethasone from GR by fluorescent polarization assay
J Med Chem 53: 4531-44 (2010)
Article DOI: 10.1021/jm100447c
BindingDB Entry DOI: 10.7270/Q20003BB