BDBM50416382 CHEMBL1210559
SMILES: Cc1n[nH]c(C)c1CC(=O)NCc1ccc(F)cc1C(F)(F)F
InChI Key: InChIKey=COUAVKQOVPKTFT-UHFFFAOYSA-N
Data: 1 IC50
Activity Spreadsheet -- Enzyme Inhibition Constant Data from BindingDB
Found 1 hit for monomerid = 50416382
Trg + Lig
Ki
nM
ΔG°
kcal/mole
IC50
nM
Kd
nM
EC50/IC50
nM
koff
s-1
kon
M-1s-1
pHTemp
°C
P2X purinoceptor 7
(Homo sapiens (Human))
BDBM50416382
(CHEMBL1210559)
Show SMILES Cc1n[nH]c(C)c1CC(=O)NCc1ccc(F)cc1C(F)(F)F
Show InChI InChI=1S/C15H15F4N3O/c1-8-12(9(2)22-21-8)6-14(23)20-7-10-3-4-11(16)5-13(10)15(17,18)19/h3-5H,6-7H2,1-2H3,(H,20,23)(H,21,22)
n/an/a 39.8n/an/an/an/an/an/a
GlaxoSmithKline
Curated by ChEMBL
Assay Description
Antagonist activity at human P2X7 receptor ethidium bromide release assay
Bioorg Med Chem Lett 20: 4653-6 (2010)
Article DOI: 10.1016/j.bmcl.2010.05.107
BindingDB Entry DOI: 10.7270/Q2DZ09HF