BDBM50416466 CHEMBL1209576
SMILES: CN1CCN(CC1)C(=O)c1cn2[C@@H](COc3cccc1c23)C1CCCCC1
InChI Key: InChIKey=ROYMHWOULZALOP-IBGZPJMESA-N
Data: 1 EC50
Activity Spreadsheet -- Enzyme Inhibition Constant Data from BindingDB
Found 1 hit for monomerid = 50416466
Trg + Lig
Ki
nM
ΔG°
kcal/mole
IC50
nM
Kd
nM
EC50/IC50
nM
koff
s-1
kon
M-1s-1
pHTemp
°C
Cannabinoid receptor 1
(Homo sapiens (Human))
BDBM50416466
(CHEMBL1209576)
Show SMILES CN1CCN(CC1)C(=O)c1cn2[C@@H](COc3cccc1c23)C1CCCCC1 |r|
Show InChI InChI=1S/C22H29N3O2/c1-23-10-12-24(13-11-23)22(26)18-14-25-19(16-6-3-2-4-7-16)15-27-20-9-5-8-17(18)21(20)25/h5,8-9,14,16,19H,2-4,6-7,10-13,15H2,1H3/t19-/m0/s1
NCI pathway
Reactome pathway
n/an/an/an/a 100n/an/an/an/a
Schering-Plough Research Institute
Curated by ChEMBL
Assay Description
Agonist activity at human cannabinoid CB1 receptor expressed in CHO cells after 5 hrs by luciferase reporter gene assay
Bioorg Med Chem Lett 20: 4918-21 (2010)
Article DOI: 10.1016/j.bmcl.2010.06.067
BindingDB Entry DOI: 10.7270/Q21R6RS6