BDBM50416548 CHEMBL1215445
SMILES: NC(=O)C(Cc1ccccc1)NC(=O)c1ccc(cc1)-c1cccc2[nH]ccc12
InChI Key: InChIKey=RFTIIWAKGXYCRV-UHFFFAOYSA-N
Data: 1 IC50
Activity Spreadsheet -- Enzyme Inhibition Constant Data from BindingDB
Found 1 hit for monomerid = 50416548
Trg + Lig
Ki
nM
ΔG°
kcal/mole
IC50
nM
Kd
nM
EC50/IC50
nM
koff
s-1
kon
M-1s-1
pHTemp
°C
Prostaglandin D Synthase
(Homo sapiens (Human))
BDBM50416548
(CHEMBL1215445)
Show SMILES NC(=O)C(Cc1ccccc1)NC(=O)c1ccc(cc1)-c1cccc2[nH]ccc12
Show InChI InChI=1S/C24H21N3O2/c25-23(28)22(15-16-5-2-1-3-6-16)27-24(29)18-11-9-17(10-12-18)19-7-4-8-21-20(19)13-14-26-21/h1-14,22,26H,15H2,(H2,25,28)(H,27,29)
Reactome pathway
n/an/a 1.47E+4n/an/an/an/an/an/a
The University of Queensland
Curated by ChEMBL
Assay Description
Inhibition of human H-PGDS expressed in Escherichia coli BL21 DE2 by enzyme immuno assay at 50 uM
J Med Chem 53: 5536-48 (2010)
Article DOI: 10.1021/jm100194a
BindingDB Entry DOI: 10.7270/Q21J99Z4