BDBM50416550 CHEMBL1215372
SMILES: CC(C)C(NC(=O)c1ccc(cc1)-c1cccc(O)c1)C(N)=O
InChI Key: InChIKey=LIHXFKSRELDIPD-UHFFFAOYSA-N
Data: 1 IC50
Activity Spreadsheet -- Enzyme Inhibition Constant Data from BindingDB
Found 1 hit for monomerid = 50416550
Trg + Lig
Ki
nM
ΔG°
kcal/mole
IC50
nM
Kd
nM
EC50/IC50
nM
koff
s-1
kon
M-1s-1
pHTemp
°C
Prostaglandin D Synthase
(Homo sapiens (Human))
BDBM50416550
(CHEMBL1215372)
Show SMILES CC(C)C(NC(=O)c1ccc(cc1)-c1cccc(O)c1)C(N)=O
Show InChI InChI=1S/C18H20N2O3/c1-11(2)16(17(19)22)20-18(23)13-8-6-12(7-9-13)14-4-3-5-15(21)10-14/h3-11,16,21H,1-2H3,(H2,19,22)(H,20,23)
Reactome pathway
n/an/a 5.33E+4n/an/an/an/an/an/a
The University of Queensland
Curated by ChEMBL
Assay Description
Inhibition of human H-PGDS expressed in Escherichia coli BL21 DE2 by enzyme immuno assay at 50 uM
J Med Chem 53: 5536-48 (2010)
Article DOI: 10.1021/jm100194a
BindingDB Entry DOI: 10.7270/Q21J99Z4