BDBM50416559 CHEMBL1215229
SMILES: O=C(NC(c1ccccc1)c1ccccc1)c1ccc(cc1)-c1ccccc1
InChI Key: InChIKey=VXUVQKPRQMGSLY-UHFFFAOYSA-N
Data: 1 IC50
Activity Spreadsheet -- Enzyme Inhibition Constant Data from BindingDB
Found 1 hit for monomerid = 50416559
Trg + Lig
Ki
nM
ΔG°
kcal/mole
IC50
nM
Kd
nM
EC50/IC50
nM
koff
s-1
kon
M-1s-1
pHTemp
°C
Prostaglandin D Synthase
(Homo sapiens (Human))
BDBM50416559
(CHEMBL1215229)
Show SMILES O=C(NC(c1ccccc1)c1ccccc1)c1ccc(cc1)-c1ccccc1
Show InChI InChI=1S/C26H21NO/c28-26(24-18-16-21(17-19-24)20-10-4-1-5-11-20)27-25(22-12-6-2-7-13-22)23-14-8-3-9-15-23/h1-19,25H,(H,27,28)
Reactome pathway
n/an/a 6.27E+3n/an/an/an/an/an/a
The University of Queensland
Curated by ChEMBL
Assay Description
Inhibition of human H-PGDS expressed in Escherichia coli BL21 DE2 by enzyme immuno assay at 50 uM
J Med Chem 53: 5536-48 (2010)
Article DOI: 10.1021/jm100194a
BindingDB Entry DOI: 10.7270/Q21J99Z4