BDBM50416880 CHEMBL1256366
SMILES: Cc1cc(ccc1F)C(C)(O)c1nc2ccccc2s1
InChI Key: InChIKey=KTBXJVVQKJRIAZ-UHFFFAOYSA-N
Data: 1 EC50
Activity Spreadsheet -- Enzyme Inhibition Constant Data from BindingDB
Found 1 hit for monomerid = 50416880
Trg + Lig
Ki
nM
ΔG°
kcal/mole
IC50
nM
Kd
nM
EC50/IC50
nM
koff
s-1
kon
M-1s-1
pHTemp
°C
Calcium-sensing receptor (CaSR)
(Homo sapiens (Human))
BDBM50416880
(CHEMBL1256366)
Show SMILES Cc1cc(ccc1F)C(C)(O)c1nc2ccccc2s1
Show InChI InChI=1S/C16H14FNOS/c1-10-9-11(7-8-12(10)17)16(2,19)15-18-13-5-3-4-6-14(13)20-15/h3-9,19H,1-2H3
n/an/an/an/a 158n/an/an/an/a
ACADIA Pharmaceuticals AB
Curated by ChEMBL
Assay Description
Positive allosteric modulation of calcium sensing receptor by cell based assay
Bioorg Med Chem Lett 20: 5918-21 (2010)
Article DOI: 10.1016/j.bmcl.2010.07.077
BindingDB Entry DOI: 10.7270/Q22J6D4S