BDBM50417092 CHEMBL1258241
SMILES: Brc1ccc(NC(=O)N[C@@H]2C3CCN(CC3)[C@H]2Cc2cccnc2)cc1
InChI Key: InChIKey=ZWXIQEUZDPMEKN-RBUKOAKNSA-N
Data: 2 KI  1 Kd
Activity Spreadsheet -- Enzyme Inhibition Constant Data from BindingDB
Found 3 hits for monomerid = 50417092
Trg + Lig
Ki
nM
ΔG°
kcal/mole
IC50
nM
Kd
nM
EC50/IC50
nM
koff
s-1
kon
M-1s-1
pHTemp
°C
Neuronal acetylcholine receptor protein alpha-7 subunit
(Homo sapiens (Human))
BDBM50417092
(CHEMBL1258241)
Show SMILES Brc1ccc(NC(=O)N[C@@H]2C3CCN(CC3)[C@H]2Cc2cccnc2)cc1 |r,wU:9.8,wD:16.18,TLB:17:16:12.11:14.15,THB:8:9:12.11:14.15,(.24,-7.48,;-1.08,-6.7,;-2.43,-7.45,;-3.75,-6.66,;-3.73,-5.12,;-5.05,-4.33,;-6.39,-5.08,;-6.41,-6.62,;-7.72,-4.3,;-9.06,-5.05,;-10.53,-4.41,;-11.89,-5.02,;-12.17,-6.41,;-10.79,-5.78,;-11.05,-3.87,;-10.6,-2.77,;-9.26,-6.43,;-8.5,-7.77,;-9.28,-9.1,;-10.82,-9.08,;-11.61,-10.4,;-10.84,-11.74,;-9.29,-11.75,;-8.52,-10.43,;-2.39,-4.37,;-1.07,-5.15,)|
Show InChI InChI=1S/C20H23BrN4O/c21-16-3-5-17(6-4-16)23-20(26)24-19-15-7-10-25(11-8-15)18(19)12-14-2-1-9-22-13-14/h1-6,9,13,15,18-19H,7-8,10-12H2,(H2,23,24,26)/t18-,19+/m0/s1
25.7n/an/an/an/an/an/an/an/a
VU University Amsterdam
Curated by ChEMBL
Assay Description
Displacement of [3H]-MLA from human alpha7 nAChR expressed in human SH-SY5Y cells
J Med Chem 53: 7192-201 (2010)
Article DOI: 10.1021/jm100834y
BindingDB Entry DOI: 10.7270/Q21J9C1V
Acetylcholine Binding protein
(Lymnaea stagnalis)
BDBM50417092
(CHEMBL1258241)
Show SMILES Brc1ccc(NC(=O)N[C@@H]2C3CCN(CC3)[C@H]2Cc2cccnc2)cc1 |r,wU:9.8,wD:16.18,TLB:17:16:12.11:14.15,THB:8:9:12.11:14.15,(.24,-7.48,;-1.08,-6.7,;-2.43,-7.45,;-3.75,-6.66,;-3.73,-5.12,;-5.05,-4.33,;-6.39,-5.08,;-6.41,-6.62,;-7.72,-4.3,;-9.06,-5.05,;-10.53,-4.41,;-11.89,-5.02,;-12.17,-6.41,;-10.79,-5.78,;-11.05,-3.87,;-10.6,-2.77,;-9.26,-6.43,;-8.5,-7.77,;-9.28,-9.1,;-10.82,-9.08,;-11.61,-10.4,;-10.84,-11.74,;-9.29,-11.75,;-8.52,-10.43,;-2.39,-4.37,;-1.07,-5.15,)|
Show InChI InChI=1S/C20H23BrN4O/c21-16-3-5-17(6-4-16)23-20(26)24-19-15-7-10-25(11-8-15)18(19)12-14-2-1-9-22-13-14/h1-6,9,13,15,18-19H,7-8,10-12H2,(H2,23,24,26)/t18-,19+/m0/s1
708n/an/an/an/an/an/an/an/a
VU University Amsterdam
Curated by ChEMBL
Assay Description
Displacement of [3H]epibatidine from Lymnaea stagnalis His6-AChBP expressed in Bac-to-Bac baculovirus expression system
J Med Chem 53: 7192-201 (2010)
Article DOI: 10.1021/jm100834y
BindingDB Entry DOI: 10.7270/Q21J9C1V
Acetylcholine Binding protein
(Lymnaea stagnalis)
BDBM50417092
(CHEMBL1258241)
Show SMILES Brc1ccc(NC(=O)N[C@@H]2C3CCN(CC3)[C@H]2Cc2cccnc2)cc1 |r,wU:9.8,wD:16.18,TLB:17:16:12.11:14.15,THB:8:9:12.11:14.15,(.24,-7.48,;-1.08,-6.7,;-2.43,-7.45,;-3.75,-6.66,;-3.73,-5.12,;-5.05,-4.33,;-6.39,-5.08,;-6.41,-6.62,;-7.72,-4.3,;-9.06,-5.05,;-10.53,-4.41,;-11.89,-5.02,;-12.17,-6.41,;-10.79,-5.78,;-11.05,-3.87,;-10.6,-2.77,;-9.26,-6.43,;-8.5,-7.77,;-9.28,-9.1,;-10.82,-9.08,;-11.61,-10.4,;-10.84,-11.74,;-9.29,-11.75,;-8.52,-10.43,;-2.39,-4.37,;-1.07,-5.15,)|
Show InChI InChI=1S/C20H23BrN4O/c21-16-3-5-17(6-4-16)23-20(26)24-19-15-7-10-25(11-8-15)18(19)12-14-2-1-9-22-13-14/h1-6,9,13,15,18-19H,7-8,10-12H2,(H2,23,24,26)/t18-,19+/m0/s1
n/an/an/a 437n/an/an/an/an/a
VU University Amsterdam
Curated by ChEMBL
Assay Description
Binding affinity to Lymnaea stagnalis His6-AChBP expressed in Bac-to-Bac baculovirus expression system by surface plasmon resonance biosensor assay
J Med Chem 53: 7192-201 (2010)
Article DOI: 10.1021/jm100834y
BindingDB Entry DOI: 10.7270/Q21J9C1V