BDBM50417272 CHEMBL1271604
SMILES: CN1[C@@H](CNC1=O)C(=O)NCc1cccc(c1Cl)C(F)(F)F
InChI Key: InChIKey=GUOUDHATONUOTH-VIFPVBQESA-N
Data: 1 IC50
Activity Spreadsheet -- Enzyme Inhibition Constant Data from BindingDB
Found 1 hit for monomerid = 50417272
Trg + Lig
Ki
nM
ΔG°
kcal/mole
IC50
nM
Kd
nM
EC50/IC50
nM
koff
s-1
kon
M-1s-1
pHTemp
°C
P2X purinoceptor 7
(Homo sapiens (Human))
BDBM50417272
(CHEMBL1271604)
Show SMILES CN1[C@@H](CNC1=O)C(=O)NCc1cccc(c1Cl)C(F)(F)F |r|
Show InChI InChI=1S/C13H13ClF3N3O2/c1-20-9(6-19-12(20)22)11(21)18-5-7-3-2-4-8(10(7)14)13(15,16)17/h2-4,9H,5-6H2,1H3,(H,18,21)(H,19,22)/t9-/m0/s1
n/an/a 3.98n/an/an/an/an/an/a
GlaxoSmithKline
Curated by ChEMBL
Assay Description
Antagonist activity at human recombinant P2X7 receptor expressed in HEK293 cells by ethidium accumulation assay
Bioorg Med Chem Lett 20: 6370-4 (2010)
Article DOI: 10.1016/j.bmcl.2010.09.101
BindingDB Entry DOI: 10.7270/Q2NC62GP