BDBM50417759 CHEMBL1644213
SMILES: COc1nc(NCCc2ccc(Cl)cc2Cl)cc(n1)-c1cccc(c1)C(O)=O
InChI Key: InChIKey=BDUACRVWCKJSNP-UHFFFAOYSA-N
Data: 1 IC50
Activity Spreadsheet -- Enzyme Inhibition Constant Data from BindingDB
Found 1 hit for monomerid = 50417759
Trg + Lig
Ki
nM
ΔG°
kcal/mole
IC50
nM
Kd
nM
EC50/IC50
nM
koff
s-1
kon
M-1s-1
pHTemp
°C
Prostanoid DP receptor
(Homo sapiens (Human))
BDBM50417759
(CHEMBL1644213)
Show SMILES COc1nc(NCCc2ccc(Cl)cc2Cl)cc(n1)-c1cccc(c1)C(O)=O
Show InChI InChI=1S/C20H17Cl2N3O3/c1-28-20-24-17(13-3-2-4-14(9-13)19(26)27)11-18(25-20)23-8-7-12-5-6-15(21)10-16(12)22/h2-6,9-11H,7-8H2,1H3,(H,26,27)(H,23,24,25)
n/an/a 0.302n/an/an/an/an/an/a
Sanofi Aventis US
Curated by ChEMBL
Assay Description
Antagonist activity at prostaglandin D2 receptor in human LS174T cells assessed as inhibition of PGD2-induced cAMP accumulation after 15 mins by scin...
Bioorg Med Chem Lett 21: 66-75 (2010)
Article DOI: 10.1016/j.bmcl.2010.11.071
BindingDB Entry DOI: 10.7270/Q22F7PPM