null
SMILES: CCOc1nc2ccccc2nc1C(=O)Nc1cccnc1
InChI Key: InChIKey=NPECBJIKEVXKOY-UHFFFAOYSA-N
Activity Spreadsheet -- Enzyme Inhibition Constant Data from BindingDB
Found 1 hit for monomerid = 50417859
Trg + Lig
Ki
nM
ΔG°
kcal/mole
IC50
nM
Kd
nM
EC50/IC50
nM
koff
s-1
kon
M-1s-1
pHTemp
°C
5-hydroxytryptamine receptor 3A
(GUINEA PIG)
BDBM50417859
(CHEMBL1668029)
Show SMILES CCOc1nc2ccccc2nc1C(=O)Nc1cccnc1
Show InChI InChI=1S/C16H14N4O2/c1-2-22-16-14(15(21)18-11-6-5-9-17-10-11)19-12-7-3-4-8-13(12)20-16/h3-10H,2H2,1H3,(H,18,21)
n/an/an/a 1.58E+4n/an/an/an/an/a
Birla Institute of Technology& Science
Curated by ChEMBL
Assay Description
Antagonist activity at 5-HT3 receptor in guinea pig ileum muscle
Bioorg Med Chem Lett 21: 1253-6 (2011)
Article DOI: 10.1016/j.bmcl.2010.12.064
BindingDB Entry DOI: 10.7270/Q28W3FJR