BDBM50417896 CHEMBL1668086
SMILES: CC(C)NC(=O)c1cccc(c1)-n1ncc2c(NC[C@H](C)NS(=O)(=O)C3CC3)cc(C)cc12
InChI Key: InChIKey=FNYSDOWPXRIBND-KRWDZBQOSA-N
Data: 3 IC50
Activity Spreadsheet -- Enzyme Inhibition Constant Data from BindingDB
Found 3 hits for monomerid = 50417896
Trg + Lig
Ki
nM
ΔG°
kcal/mole
IC50
nM
Kd
nM
EC50/IC50
nM
koff
s-1
kon
M-1s-1
pHTemp
°C
Glucocorticoid receptor
(Homo sapiens (Human))
BDBM50417896
(CHEMBL1668086)
Show SMILES CC(C)NC(=O)c1cccc(c1)-n1ncc2c(NC[C@H](C)NS(=O)(=O)C3CC3)cc(C)cc12 |r|
Show InChI InChI=1S/C24H31N5O3S/c1-15(2)27-24(30)18-6-5-7-19(12-18)29-23-11-16(3)10-22(21(23)14-26-29)25-13-17(4)28-33(31,32)20-8-9-20/h5-7,10-12,14-15,17,20,25,28H,8-9,13H2,1-4H3,(H,27,30)/t17-/m0/s1
n/an/a 15.8n/an/an/an/an/an/a
GlaxoSmithKline Medicines Research Center
Curated by ChEMBL
Assay Description
Displacement of fluorescent-labelled Dexamethasone from glucocorticoid receptor
Bioorg Med Chem Lett 21: 1126-33 (2011)
Article DOI: 10.1016/j.bmcl.2010.12.121
BindingDB Entry DOI: 10.7270/Q2571D8H
Glucocorticoid receptor
(Homo sapiens (Human))
BDBM50417896
(CHEMBL1668086)
Show SMILES CC(C)NC(=O)c1cccc(c1)-n1ncc2c(NC[C@H](C)NS(=O)(=O)C3CC3)cc(C)cc12 |r|
Show InChI InChI=1S/C24H31N5O3S/c1-15(2)27-24(30)18-6-5-7-19(12-18)29-23-11-16(3)10-22(21(23)14-26-29)25-13-17(4)28-33(31,32)20-8-9-20/h5-7,10-12,14-15,17,20,25,28H,8-9,13H2,1-4H3,(H,27,30)/t17-/m0/s1
n/an/a 12.6n/an/an/an/an/an/a
GlaxoSmithKline Medicines Research Center
Curated by ChEMBL
Assay Description
Agonist activity at GR in human A549 cells transfected with luciferase gene linked to MMTV promoter assessed as luciferase transactivation activity
Bioorg Med Chem Lett 21: 1126-33 (2011)
Article DOI: 10.1016/j.bmcl.2010.12.121
BindingDB Entry DOI: 10.7270/Q2571D8H
Glucocorticoid receptor
(Homo sapiens (Human))
BDBM50417896
(CHEMBL1668086)
Show SMILES CC(C)NC(=O)c1cccc(c1)-n1ncc2c(NC[C@H](C)NS(=O)(=O)C3CC3)cc(C)cc12 |r|
Show InChI InChI=1S/C24H31N5O3S/c1-15(2)27-24(30)18-6-5-7-19(12-18)29-23-11-16(3)10-22(21(23)14-26-29)25-13-17(4)28-33(31,32)20-8-9-20/h5-7,10-12,14-15,17,20,25,28H,8-9,13H2,1-4H3,(H,27,30)/t17-/m0/s1
n/an/a 2n/an/an/an/an/an/a
GlaxoSmithKline Medicines Research Center
Curated by ChEMBL
Assay Description
Agonist activity at glucocorticoid receptor in human A549 cells by NF-kappaB transrepression assay
Bioorg Med Chem Lett 21: 1126-33 (2011)
Article DOI: 10.1016/j.bmcl.2010.12.121
BindingDB Entry DOI: 10.7270/Q2571D8H