BDBM50417918 CHEMBL1668589::US8618114, 1.2.1(4)
SMILES: CNc1nn2cccnc2c1S(=O)(=O)c1cccc(Cl)c1
InChI Key: InChIKey=KPHVCQHKHZETCF-UHFFFAOYSA-N
Data: 1 KI  2 IC50
Activity Spreadsheet -- Enzyme Inhibition Constant Data from BindingDB
Found 3 hits for monomerid = 50417918
Trg + Lig
Ki
nM
ΔG°
kcal/mole
IC50
nM
Kd
nM
EC50/IC50
nM
koff
s-1
kon
M-1s-1
pHTemp
°C
5-hydroxytryptamine receptor 6
(Homo sapiens (Human))
BDBM50417918
(CHEMBL1668589 | US8618114, 1.2.1(4))
Show SMILES CNc1nn2cccnc2c1S(=O)(=O)c1cccc(Cl)c1
Show InChI InChI=1S/C13H11ClN4O2S/c1-15-12-11(13-16-6-3-7-18(13)17-12)21(19,20)10-5-2-4-9(14)8-10/h2-8H,1H3,(H,15,17)
Reactome pathway
1.17n/an/an/an/an/an/an/an/a
Chemical Diversity Research Institute
Curated by ChEMBL
Assay Description
Antagonist activity at human recombinant 5HT6 receptor expressed in HEK293 cells assessed as inhibition of serotonin-induced cAMP accumulation after ...
Bioorg Med Chem 19: 1482-91 (2011)
Article DOI: 10.1016/j.bmc.2010.12.055
BindingDB Entry DOI: 10.7270/Q21G0NJS
5-hydroxytryptamine receptor 6
(Homo sapiens (Human))
BDBM50417918
(CHEMBL1668589 | US8618114, 1.2.1(4))
Show SMILES CNc1nn2cccnc2c1S(=O)(=O)c1cccc(Cl)c1
Show InChI InChI=1S/C13H11ClN4O2S/c1-15-12-11(13-16-6-3-7-18(13)17-12)21(19,20)10-5-2-4-9(14)8-10/h2-8H,1H3,(H,15,17)
Reactome pathway
US Patent
n/an/a 5.01n/an/an/an/an/an/a
TBA
US Patent
Assay Description
Screening of the disclosed compounds for their potential ability to interact with serotonin 5-HT6 receptors was carried out by method of radioligand ...
US Patent US8618114 (2013)
BindingDB Entry DOI: 10.7270/Q2B56HD9
5-hydroxytryptamine receptor 6
(Homo sapiens (Human))
BDBM50417918
(CHEMBL1668589 | US8618114, 1.2.1(4))
Show SMILES CNc1nn2cccnc2c1S(=O)(=O)c1cccc(Cl)c1
Show InChI InChI=1S/C13H11ClN4O2S/c1-15-12-11(13-16-6-3-7-18(13)17-12)21(19,20)10-5-2-4-9(14)8-10/h2-8H,1H3,(H,15,17)
Reactome pathway
US Patent
n/an/a 24n/an/an/an/an/an/a
TBA
US Patent
Assay Description
Determination of antagonistic activity of compounds of the general formula 1 towards 5-HT6 receptors. Compounds of the general formula 1 were tested ...
US Patent US8618114 (2013)
BindingDB Entry DOI: 10.7270/Q2B56HD9