BDBM50418142 CHEMBL1760405
SMILES: CCCN(c1cccc(c1C)-c1ccc(Cl)cc1)S(=O)(=O)c1ccc(OC(C)C(O)=O)c(C)c1C
InChI Key: InChIKey=NCWCKTNFULGDMU-UHFFFAOYSA-N
Data: 3 IC50  1 EC50
Activity Spreadsheet -- Enzyme Inhibition Constant Data from BindingDB
Found 4 hits for monomerid = 50418142
Trg + Lig
Ki
nM
ΔG°
kcal/mole
IC50
nM
Kd
nM
EC50/IC50
nM
koff
s-1
kon
M-1s-1
pHTemp
°C
Peroxisome proliferator-activated receptor delta
(Homo sapiens (Human))
BDBM50418142
(CHEMBL1760405)
Show SMILES CCCN(c1cccc(c1C)-c1ccc(Cl)cc1)S(=O)(=O)c1ccc(OC(C)C(O)=O)c(C)c1C
Show InChI InChI=1S/C27H30ClNO5S/c1-6-16-29(24-9-7-8-23(19(24)4)21-10-12-22(28)13-11-21)35(32,33)26-15-14-25(17(2)18(26)3)34-20(5)27(30)31/h7-15,20H,6,16H2,1-5H3,(H,30,31)
n/an/a 126n/an/an/an/an/an/a
GlaxoSmithKline Pharmaceuticals
Curated by ChEMBL
Assay Description
Displacement of [3H]GW 2433 from human PPARdelta by scintillation proximity assay
Bioorg Med Chem Lett 21: 2345-50 (2011)
Article DOI: 10.1016/j.bmcl.2011.02.077
BindingDB Entry DOI: 10.7270/Q2M61MHT
Peroxisome proliferator-activated receptor alpha (PPAR alpha)
(Homo sapiens (Human))
BDBM50418142
(CHEMBL1760405)
Show SMILES CCCN(c1cccc(c1C)-c1ccc(Cl)cc1)S(=O)(=O)c1ccc(OC(C)C(O)=O)c(C)c1C
Show InChI InChI=1S/C27H30ClNO5S/c1-6-16-29(24-9-7-8-23(19(24)4)21-10-12-22(28)13-11-21)35(32,33)26-15-14-25(17(2)18(26)3)34-20(5)27(30)31/h7-15,20H,6,16H2,1-5H3,(H,30,31)
n/an/a 2.00E+4n/an/an/an/an/an/a
GlaxoSmithKline Pharmaceuticals
Curated by ChEMBL
Assay Description
Displacement of [3H]GW 2433 from human PPARalpha by scintillation proximity assay
Bioorg Med Chem Lett 21: 2345-50 (2011)
Article DOI: 10.1016/j.bmcl.2011.02.077
BindingDB Entry DOI: 10.7270/Q2M61MHT
Peroxisome proliferator-activated receptor
(Homo sapiens (Human))
BDBM50418142
(CHEMBL1760405)
Show SMILES CCCN(c1cccc(c1C)-c1ccc(Cl)cc1)S(=O)(=O)c1ccc(OC(C)C(O)=O)c(C)c1C
Show InChI InChI=1S/C27H30ClNO5S/c1-6-16-29(24-9-7-8-23(19(24)4)21-10-12-22(28)13-11-21)35(32,33)26-15-14-25(17(2)18(26)3)34-20(5)27(30)31/h7-15,20H,6,16H2,1-5H3,(H,30,31)
NCI pathway
Reactome pathway
n/an/a 7.94E+3n/an/an/an/an/an/a
GlaxoSmithKline Pharmaceuticals
Curated by ChEMBL
Assay Description
Displacement of [3H]GW 2433 from human PPARgamma by scintillation proximity assay
Bioorg Med Chem Lett 21: 2345-50 (2011)
Article DOI: 10.1016/j.bmcl.2011.02.077
BindingDB Entry DOI: 10.7270/Q2M61MHT
Peroxisome proliferator-activated receptor delta
(Homo sapiens (Human))
BDBM50418142
(CHEMBL1760405)
Show SMILES CCCN(c1cccc(c1C)-c1ccc(Cl)cc1)S(=O)(=O)c1ccc(OC(C)C(O)=O)c(C)c1C
Show InChI InChI=1S/C27H30ClNO5S/c1-6-16-29(24-9-7-8-23(19(24)4)21-10-12-22(28)13-11-21)35(32,33)26-15-14-25(17(2)18(26)3)34-20(5)27(30)31/h7-15,20H,6,16H2,1-5H3,(H,30,31)
n/an/an/an/a 79n/an/an/an/a
GlaxoSmithKline Pharmaceuticals
Curated by ChEMBL
Assay Description
Partial agonist activity at human PPARdelta expressed in african green monkey CV1 cells transfected with Gal4 assessed as beta-galactosidase activity...
Bioorg Med Chem Lett 21: 2345-50 (2011)
Article DOI: 10.1016/j.bmcl.2011.02.077
BindingDB Entry DOI: 10.7270/Q2M61MHT