BDBM50418162 CHEMBL1760425
SMILES: CCCCN(c1cccc(c1C)-c1ccc(OC(F)(F)F)cc1)S(=O)(=O)c1ccc(OC(C)C(O)=O)c(C)c1C
InChI Key: InChIKey=JYCKBJRDVRAJCY-UHFFFAOYSA-N
Data: 3 IC50  1 EC50
Activity Spreadsheet -- Enzyme Inhibition Constant Data from BindingDB
Found 4 hits for monomerid = 50418162
Trg + Lig
Ki
nM
ΔG°
kcal/mole
IC50
nM
Kd
nM
EC50/IC50
nM
koff
s-1
kon
M-1s-1
pHTemp
°C
Peroxisome proliferator-activated receptor delta
(Homo sapiens (Human))
BDBM50418162
(CHEMBL1760425)
Show SMILES CCCCN(c1cccc(c1C)-c1ccc(OC(F)(F)F)cc1)S(=O)(=O)c1ccc(OC(C)C(O)=O)c(C)c1C
Show InChI InChI=1S/C29H32F3NO6S/c1-6-7-17-33(40(36,37)27-16-15-26(18(2)19(27)3)38-21(5)28(34)35)25-10-8-9-24(20(25)4)22-11-13-23(14-12-22)39-29(30,31)32/h8-16,21H,6-7,17H2,1-5H3,(H,34,35)
n/an/a 79n/an/an/an/an/an/a
GlaxoSmithKline Pharmaceuticals
Curated by ChEMBL
Assay Description
Displacement of [3H]GW 2433 from human PPARdelta by scintillation proximity assay
Bioorg Med Chem Lett 21: 2345-50 (2011)
Article DOI: 10.1016/j.bmcl.2011.02.077
BindingDB Entry DOI: 10.7270/Q2M61MHT
Peroxisome proliferator-activated receptor alpha (PPAR alpha)
(Homo sapiens (Human))
BDBM50418162
(CHEMBL1760425)
Show SMILES CCCCN(c1cccc(c1C)-c1ccc(OC(F)(F)F)cc1)S(=O)(=O)c1ccc(OC(C)C(O)=O)c(C)c1C
Show InChI InChI=1S/C29H32F3NO6S/c1-6-7-17-33(40(36,37)27-16-15-26(18(2)19(27)3)38-21(5)28(34)35)25-10-8-9-24(20(25)4)22-11-13-23(14-12-22)39-29(30,31)32/h8-16,21H,6-7,17H2,1-5H3,(H,34,35)
n/an/a 1.00E+4n/an/an/an/an/an/a
GlaxoSmithKline Pharmaceuticals
Curated by ChEMBL
Assay Description
Displacement of [3H]GW 2433 from human PPARalpha by scintillation proximity assay
Bioorg Med Chem Lett 21: 2345-50 (2011)
Article DOI: 10.1016/j.bmcl.2011.02.077
BindingDB Entry DOI: 10.7270/Q2M61MHT
Peroxisome proliferator-activated receptor
(Homo sapiens (Human))
BDBM50418162
(CHEMBL1760425)
Show SMILES CCCCN(c1cccc(c1C)-c1ccc(OC(F)(F)F)cc1)S(=O)(=O)c1ccc(OC(C)C(O)=O)c(C)c1C
Show InChI InChI=1S/C29H32F3NO6S/c1-6-7-17-33(40(36,37)27-16-15-26(18(2)19(27)3)38-21(5)28(34)35)25-10-8-9-24(20(25)4)22-11-13-23(14-12-22)39-29(30,31)32/h8-16,21H,6-7,17H2,1-5H3,(H,34,35)
NCI pathway
Reactome pathway
n/an/a 5.01E+3n/an/an/an/an/an/a
GlaxoSmithKline Pharmaceuticals
Curated by ChEMBL
Assay Description
Displacement of [3H]GW 2433 from human PPARgamma by scintillation proximity assay
Bioorg Med Chem Lett 21: 2345-50 (2011)
Article DOI: 10.1016/j.bmcl.2011.02.077
BindingDB Entry DOI: 10.7270/Q2M61MHT
Peroxisome proliferator-activated receptor delta
(Homo sapiens (Human))
BDBM50418162
(CHEMBL1760425)
Show SMILES CCCCN(c1cccc(c1C)-c1ccc(OC(F)(F)F)cc1)S(=O)(=O)c1ccc(OC(C)C(O)=O)c(C)c1C
Show InChI InChI=1S/C29H32F3NO6S/c1-6-7-17-33(40(36,37)27-16-15-26(18(2)19(27)3)38-21(5)28(34)35)25-10-8-9-24(20(25)4)22-11-13-23(14-12-22)39-29(30,31)32/h8-16,21H,6-7,17H2,1-5H3,(H,34,35)
n/an/an/an/a 40n/an/an/an/a
GlaxoSmithKline Pharmaceuticals
Curated by ChEMBL
Assay Description
Partial agonist activity at human PPARdelta expressed in african green monkey CV1 cells transfected with Gal4 assessed as beta-galactosidase activity...
Bioorg Med Chem Lett 21: 2345-50 (2011)
Article DOI: 10.1016/j.bmcl.2011.02.077
BindingDB Entry DOI: 10.7270/Q2M61MHT