BDBM50418171 CHEMBL1761517
SMILES: CN(C)C(=O)c1cc(cc2cc[nH]c12)-c1ccccc1
InChI Key: InChIKey=YDYUQGVFMKKPRK-UHFFFAOYSA-N
Data: 1 IC50
Activity Spreadsheet -- Enzyme Inhibition Constant Data from BindingDB
Found 1 hit for monomerid = 50418171
Trg + Lig
Ki
nM
ΔG°
kcal/mole
IC50
nM
Kd
nM
EC50/IC50
nM
koff
s-1
kon
M-1s-1
pHTemp
°C
Inhibitor of nuclear factor kappa-B kinase subunit beta
(Homo sapiens (Human))
BDBM50418171
(CHEMBL1761517)
Show SMILES CN(C)C(=O)c1cc(cc2cc[nH]c12)-c1ccccc1
Show InChI InChI=1S/C17H16N2O/c1-19(2)17(20)15-11-14(12-6-4-3-5-7-12)10-13-8-9-18-16(13)15/h3-11,18H,1-2H3
NCI pathway
Reactome pathway
n/an/a>1.58E+4n/an/an/an/an/an/a
GlaxoSmithKline R&D
Curated by ChEMBL
Assay Description
Inhibition of IKK-beta
Bioorg Med Chem Lett 21: 2255-8 (2011)
Article DOI: 10.1016/j.bmcl.2011.02.107
BindingDB Entry DOI: 10.7270/Q2GF0VS3