BDBM50418177 CHEMBL1761504
SMILES: NC(=O)c1cc(cc2cc[nH]c12)-c1ccc(Cl)cc1
InChI Key: InChIKey=SLDKXLRAQJSZMW-UHFFFAOYSA-N
Data: 2 IC50
Activity Spreadsheet -- Enzyme Inhibition Constant Data from BindingDB
Found 2 hits for monomerid = 50418177
Trg + Lig
Ki
nM
ΔG°
kcal/mole
IC50
nM
Kd
nM
EC50/IC50
nM
koff
s-1
kon
M-1s-1
pHTemp
°C
Inhibitor of nuclear factor kappa-B kinase subunit alpha
(Homo sapiens (Human))
BDBM50418177
(CHEMBL1761504)
Show SMILES NC(=O)c1cc(cc2cc[nH]c12)-c1ccc(Cl)cc1
Show InChI InChI=1S/C15H11ClN2O/c16-12-3-1-9(2-4-12)11-7-10-5-6-18-14(10)13(8-11)15(17)19/h1-8,18H,(H2,17,19)
Reactome pathway
n/an/a 6.31E+3n/an/an/an/an/an/a
GlaxoSmithKline R&D
Curated by ChEMBL
Assay Description
Inhibition of IKK-alpha
Bioorg Med Chem Lett 21: 2255-8 (2011)
Article DOI: 10.1016/j.bmcl.2011.02.107
BindingDB Entry DOI: 10.7270/Q2GF0VS3
Inhibitor of nuclear factor kappa-B kinase subunit beta
(Homo sapiens (Human))
BDBM50418177
(CHEMBL1761504)
Show SMILES NC(=O)c1cc(cc2cc[nH]c12)-c1ccc(Cl)cc1
Show InChI InChI=1S/C15H11ClN2O/c16-12-3-1-9(2-4-12)11-7-10-5-6-18-14(10)13(8-11)15(17)19/h1-8,18H,(H2,17,19)
NCI pathway
Reactome pathway
n/an/a 316n/an/an/an/an/an/a
GlaxoSmithKline R&D
Curated by ChEMBL
Assay Description
Inhibition of IKK-beta
Bioorg Med Chem Lett 21: 2255-8 (2011)
Article DOI: 10.1016/j.bmcl.2011.02.107
BindingDB Entry DOI: 10.7270/Q2GF0VS3