BDBM50418221 CHEMBL1760653
SMILES: Cc1ccc(Cl)cc1Cn1c(cc2cc(ccc12)C#N)C(=O)NCC(C)(C)CO
InChI Key: InChIKey=GDGMHYASAZSGQQ-UHFFFAOYSA-N
Data: 1 IC50
Activity Spreadsheet -- Enzyme Inhibition Constant Data from BindingDB
Found 1 hit for monomerid = 50418221
Trg + Lig
Ki
nM
ΔG°
kcal/mole
IC50
nM
Kd
nM
EC50/IC50
nM
koff
s-1
kon
M-1s-1
pHTemp
°C
Cannabinoid receptor 1
(Homo sapiens (Human))
BDBM50418221
(CHEMBL1760653)
Show SMILES Cc1ccc(Cl)cc1Cn1c(cc2cc(ccc12)C#N)C(=O)NCC(C)(C)CO
Show InChI InChI=1S/C23H24ClN3O2/c1-15-4-6-19(24)9-18(15)12-27-20-7-5-16(11-25)8-17(20)10-21(27)22(29)26-13-23(2,3)14-28/h4-10,28H,12-14H2,1-3H3,(H,26,29)
NCI pathway
Reactome pathway
n/an/a 0.575n/an/an/an/an/an/a
MSD
Curated by ChEMBL
Assay Description
Antagonist activity against human CB1 receptor
Bioorg Med Chem Lett 21: 2034-9 (2011)
Article DOI: 10.1016/j.bmcl.2011.02.019
BindingDB Entry DOI: 10.7270/Q27082PM