BDBM50418223 CHEMBL1760651
SMILES: COc1ccc(C)cc1Cn1c(cc2cc(ccc12)C#N)C(=O)NCC(C)(C)CO
InChI Key: InChIKey=RHSIAFAYCQNOJH-UHFFFAOYSA-N
Data: 1 IC50
Activity Spreadsheet -- Enzyme Inhibition Constant Data from BindingDB
Found 1 hit for monomerid = 50418223
Trg + Lig
Ki
nM
ΔG°
kcal/mole
IC50
nM
Kd
nM
EC50/IC50
nM
koff
s-1
kon
M-1s-1
pHTemp
°C
Cannabinoid receptor 1
(Homo sapiens (Human))
BDBM50418223
(CHEMBL1760651)
Show SMILES COc1ccc(C)cc1Cn1c(cc2cc(ccc12)C#N)C(=O)NCC(C)(C)CO
Show InChI InChI=1S/C24H27N3O3/c1-16-5-8-22(30-4)19(9-16)13-27-20-7-6-17(12-25)10-18(20)11-21(27)23(29)26-14-24(2,3)15-28/h5-11,28H,13-15H2,1-4H3,(H,26,29)
NCI pathway
Reactome pathway
n/an/a 0.759n/an/an/an/an/an/a
MSD
Curated by ChEMBL
Assay Description
Antagonist activity against human CB1 receptor
Bioorg Med Chem Lett 21: 2034-9 (2011)
Article DOI: 10.1016/j.bmcl.2011.02.019
BindingDB Entry DOI: 10.7270/Q27082PM