BDBM50418227 CHEMBL1760647
SMILES: CCOc1ccc(OC(F)(F)F)cc1Cn1c(cc2cc(ccc12)C#N)C(=O)NCC(C)(C)CO
InChI Key: InChIKey=CHMAJIUUNYDRFK-UHFFFAOYSA-N
Data: 1 IC50
Activity Spreadsheet -- Enzyme Inhibition Constant Data from BindingDB
Found 1 hit for monomerid = 50418227
Trg + Lig
Ki
nM
ΔG°
kcal/mole
IC50
nM
Kd
nM
EC50/IC50
nM
koff
s-1
kon
M-1s-1
pHTemp
°C
Cannabinoid receptor 1
(Homo sapiens (Human))
BDBM50418227
(CHEMBL1760647)
Show SMILES CCOc1ccc(OC(F)(F)F)cc1Cn1c(cc2cc(ccc12)C#N)C(=O)NCC(C)(C)CO
Show InChI InChI=1S/C25H26F3N3O4/c1-4-34-22-8-6-19(35-25(26,27)28)10-18(22)13-31-20-7-5-16(12-29)9-17(20)11-21(31)23(33)30-14-24(2,3)15-32/h5-11,32H,4,13-15H2,1-3H3,(H,30,33)
NCI pathway
Reactome pathway
n/an/a 8.32n/an/an/an/an/an/a
MSD
Curated by ChEMBL
Assay Description
Antagonist activity against human CB1 receptor
Bioorg Med Chem Lett 21: 2034-9 (2011)
Article DOI: 10.1016/j.bmcl.2011.02.019
BindingDB Entry DOI: 10.7270/Q27082PM