BDBM50418229 CHEMBL1760646
SMILES: COc1ccc(OC(F)(F)F)cc1Cn1c(cc2cc(ccc12)C#N)C(=O)NCC(C)(C)CO
InChI Key: InChIKey=SQVLCUQMGNNYIM-UHFFFAOYSA-N
Data: 2 KI  1 IC50
Activity Spreadsheet -- Enzyme Inhibition Constant Data from BindingDB
Found 3 hits for monomerid = 50418229
Trg + Lig
Ki
nM
ΔG°
kcal/mole
IC50
nM
Kd
nM
EC50/IC50
nM
koff
s-1
kon
M-1s-1
pHTemp
°C
Cannabinoid receptor 1
(Homo sapiens (Human))
BDBM50418229
(CHEMBL1760646)
Show SMILES COc1ccc(OC(F)(F)F)cc1Cn1c(cc2cc(ccc12)C#N)C(=O)NCC(C)(C)CO
Show InChI InChI=1S/C24H24F3N3O4/c1-23(2,14-31)13-29-22(32)20-10-16-8-15(11-28)4-6-19(16)30(20)12-17-9-18(34-24(25,26)27)5-7-21(17)33-3/h4-10,31H,12-14H2,1-3H3,(H,29,32)
NCI pathway
Reactome pathway
0.398n/an/an/an/an/an/an/an/a
MSD
Curated by ChEMBL
Assay Description
Displacement of [3H]SR141716A from human CB1 receptor expressed in CHO cells
Bioorg Med Chem Lett 21: 2034-9 (2011)
Article DOI: 10.1016/j.bmcl.2011.02.019
BindingDB Entry DOI: 10.7270/Q27082PM
Cannabinoid receptor 2
(Homo sapiens (Human))
BDBM50418229
(CHEMBL1760646)
Show SMILES COc1ccc(OC(F)(F)F)cc1Cn1c(cc2cc(ccc12)C#N)C(=O)NCC(C)(C)CO
Show InChI InChI=1S/C24H24F3N3O4/c1-23(2,14-31)13-29-22(32)20-10-16-8-15(11-28)4-6-19(16)30(20)12-17-9-18(34-24(25,26)27)5-7-21(17)33-3/h4-10,31H,12-14H2,1-3H3,(H,29,32)
Reactome pathway
>1.00E+4n/an/an/an/an/an/an/an/a
MSD
Curated by ChEMBL
Assay Description
Displacement of [3H]CP55940 from human recombinant CB2 receptor expressed in Sf9 cells
Bioorg Med Chem Lett 21: 2034-9 (2011)
Article DOI: 10.1016/j.bmcl.2011.02.019
BindingDB Entry DOI: 10.7270/Q27082PM
Cannabinoid receptor 1
(Homo sapiens (Human))
BDBM50418229
(CHEMBL1760646)
Show SMILES COc1ccc(OC(F)(F)F)cc1Cn1c(cc2cc(ccc12)C#N)C(=O)NCC(C)(C)CO
Show InChI InChI=1S/C24H24F3N3O4/c1-23(2,14-31)13-29-22(32)20-10-16-8-15(11-28)4-6-19(16)30(20)12-17-9-18(34-24(25,26)27)5-7-21(17)33-3/h4-10,31H,12-14H2,1-3H3,(H,29,32)
NCI pathway
Reactome pathway
n/an/a 1.17n/an/an/an/an/an/a
MSD
Curated by ChEMBL
Assay Description
Antagonist activity against human CB1 receptor
Bioorg Med Chem Lett 21: 2034-9 (2011)
Article DOI: 10.1016/j.bmcl.2011.02.019
BindingDB Entry DOI: 10.7270/Q27082PM