BDBM50418239 CHEMBL1765728
SMILES: CC[C@@H]1COCCN1c1cc(nc(N)n1)-c1ccc2c(N)n[nH]c2c1
InChI Key: InChIKey=NOAWVMJDSNKUAH-LLVKDONJSA-N
Data: 5 IC50
Activity Spreadsheet -- Enzyme Inhibition Constant Data from BindingDB
Found 5 hits for monomerid = 50418239
Trg + Lig
Ki
nM
ΔG°
kcal/mole
IC50
nM
Kd
nM
EC50/IC50
nM
koff
s-1
kon
M-1s-1
pHTemp
°C
TGF-beta receptor type-1
(Homo sapiens (Human))
BDBM50418239
(CHEMBL1765728)
Show SMILES CC[C@@H]1COCCN1c1cc(nc(N)n1)-c1ccc2c(N)n[nH]c2c1 |r|
Show InChI InChI=1S/C17H21N7O/c1-2-11-9-25-6-5-24(11)15-8-13(20-17(19)21-15)10-3-4-12-14(7-10)22-23-16(12)18/h3-4,7-8,11H,2,5-6,9H2,1H3,(H3,18,22,23)(H2,19,20,21)/t11-/m1/s1
n/an/a<1.00E+4n/an/an/an/an/an/a
GlaxoSmithKline
Curated by ChEMBL
Assay Description
Inhibition of ALK5
J Med Chem 54: 1871-95 (2011)
Article DOI: 10.1021/jm101527u
BindingDB Entry DOI: 10.7270/Q2HQ406Q
Rho-associated protein kinase 1
(Homo sapiens (Human))
BDBM50418239
(CHEMBL1765728)
Show SMILES CC[C@@H]1COCCN1c1cc(nc(N)n1)-c1ccc2c(N)n[nH]c2c1 |r|
Show InChI InChI=1S/C17H21N7O/c1-2-11-9-25-6-5-24(11)15-8-13(20-17(19)21-15)10-3-4-12-14(7-10)22-23-16(12)18/h3-4,7-8,11H,2,5-6,9H2,1H3,(H3,18,22,23)(H2,19,20,21)/t11-/m1/s1
NCI pathway
Reactome pathway
n/an/a<1.00E+4n/an/an/an/an/an/a
GlaxoSmithKline
Curated by ChEMBL
Assay Description
Inhibition of ROCK1
J Med Chem 54: 1871-95 (2011)
Article DOI: 10.1021/jm101527u
BindingDB Entry DOI: 10.7270/Q2HQ406Q
3-phosphoinositide dependent protein kinase-1
(Homo sapiens (Human))
BDBM50418239
(CHEMBL1765728)
Show SMILES CC[C@@H]1COCCN1c1cc(nc(N)n1)-c1ccc2c(N)n[nH]c2c1 |r|
Show InChI InChI=1S/C17H21N7O/c1-2-11-9-25-6-5-24(11)15-8-13(20-17(19)21-15)10-3-4-12-14(7-10)22-23-16(12)18/h3-4,7-8,11H,2,5-6,9H2,1H3,(H3,18,22,23)(H2,19,20,21)/t11-/m1/s1
NCI pathway
Reactome pathway
n/an/a 32n/an/an/an/an/an/a
GlaxoSmithKline
Curated by ChEMBL
Assay Description
Inhibition of PDK1-mediated AKT phosphorylation at Thr308 residue in human PC3 cells by ELISA
J Med Chem 54: 1871-95 (2011)
Article DOI: 10.1021/jm101527u
BindingDB Entry DOI: 10.7270/Q2HQ406Q
Aurora kinase B
(Homo sapiens (Human))
BDBM50418239
(CHEMBL1765728)
Show SMILES CC[C@@H]1COCCN1c1cc(nc(N)n1)-c1ccc2c(N)n[nH]c2c1 |r|
Show InChI InChI=1S/C17H21N7O/c1-2-11-9-25-6-5-24(11)15-8-13(20-17(19)21-15)10-3-4-12-14(7-10)22-23-16(12)18/h3-4,7-8,11H,2,5-6,9H2,1H3,(H3,18,22,23)(H2,19,20,21)/t11-/m1/s1
Reactome pathway
n/an/a<1.00E+4n/an/an/an/an/an/a
GlaxoSmithKline
Curated by ChEMBL
Assay Description
Inhibition of aurora B
J Med Chem 54: 1871-95 (2011)
Article DOI: 10.1021/jm101527u
BindingDB Entry DOI: 10.7270/Q2HQ406Q
Aurora kinase A
(Homo sapiens (Human))
BDBM50418239
(CHEMBL1765728)
Show SMILES CC[C@@H]1COCCN1c1cc(nc(N)n1)-c1ccc2c(N)n[nH]c2c1 |r|
Show InChI InChI=1S/C17H21N7O/c1-2-11-9-25-6-5-24(11)15-8-13(20-17(19)21-15)10-3-4-12-14(7-10)22-23-16(12)18/h3-4,7-8,11H,2,5-6,9H2,1H3,(H3,18,22,23)(H2,19,20,21)/t11-/m1/s1
NCI pathway
Reactome pathway
n/an/a 5.01E+3n/an/an/an/an/an/a
GlaxoSmithKline
Curated by ChEMBL
Assay Description
Inhibition of aurora A
J Med Chem 54: 1871-95 (2011)
Article DOI: 10.1021/jm101527u
BindingDB Entry DOI: 10.7270/Q2HQ406Q