BDBM50418243 CHEMBL1765732
SMILES: Nc1n[nH]c2cc(ccc12)-c1cc(nc(N)n1)N1CCC[C@@H](C1)C(=O)Nc1ccccc1
InChI Key: InChIKey=CQRFXINTEFATOH-HNNXBMFYSA-N
Data: 5 IC50
Activity Spreadsheet -- Enzyme Inhibition Constant Data from BindingDB
Found 5 hits for monomerid = 50418243
Trg + Lig
Ki
nM
ΔG°
kcal/mole
IC50
nM
Kd
nM
EC50/IC50
nM
koff
s-1
kon
M-1s-1
pHTemp
°C
TGF-beta receptor type-1
(Homo sapiens (Human))
BDBM50418243
(CHEMBL1765732)
Show SMILES Nc1n[nH]c2cc(ccc12)-c1cc(nc(N)n1)N1CCC[C@@H](C1)C(=O)Nc1ccccc1 |r|
Show InChI InChI=1S/C23H24N8O/c24-21-17-9-8-14(11-19(17)29-30-21)18-12-20(28-23(25)27-18)31-10-4-5-15(13-31)22(32)26-16-6-2-1-3-7-16/h1-3,6-9,11-12,15H,4-5,10,13H2,(H,26,32)(H3,24,29,30)(H2,25,27,28)/t15-/m0/s1
n/an/a<1.00E+4n/an/an/an/an/an/a
GlaxoSmithKline
Curated by ChEMBL
Assay Description
Inhibition of ALK5
J Med Chem 54: 1871-95 (2011)
Article DOI: 10.1021/jm101527u
BindingDB Entry DOI: 10.7270/Q2HQ406Q
Rho-associated protein kinase 1
(Homo sapiens (Human))
BDBM50418243
(CHEMBL1765732)
Show SMILES Nc1n[nH]c2cc(ccc12)-c1cc(nc(N)n1)N1CCC[C@@H](C1)C(=O)Nc1ccccc1 |r|
Show InChI InChI=1S/C23H24N8O/c24-21-17-9-8-14(11-19(17)29-30-21)18-12-20(28-23(25)27-18)31-10-4-5-15(13-31)22(32)26-16-6-2-1-3-7-16/h1-3,6-9,11-12,15H,4-5,10,13H2,(H,26,32)(H3,24,29,30)(H2,25,27,28)/t15-/m0/s1
NCI pathway
Reactome pathway
n/an/a 2.00E+3n/an/an/an/an/an/a
GlaxoSmithKline
Curated by ChEMBL
Assay Description
Inhibition of ROCK1
J Med Chem 54: 1871-95 (2011)
Article DOI: 10.1021/jm101527u
BindingDB Entry DOI: 10.7270/Q2HQ406Q
3-phosphoinositide dependent protein kinase-1
(Homo sapiens (Human))
BDBM50418243
(CHEMBL1765732)
Show SMILES Nc1n[nH]c2cc(ccc12)-c1cc(nc(N)n1)N1CCC[C@@H](C1)C(=O)Nc1ccccc1 |r|
Show InChI InChI=1S/C23H24N8O/c24-21-17-9-8-14(11-19(17)29-30-21)18-12-20(28-23(25)27-18)31-10-4-5-15(13-31)22(32)26-16-6-2-1-3-7-16/h1-3,6-9,11-12,15H,4-5,10,13H2,(H,26,32)(H3,24,29,30)(H2,25,27,28)/t15-/m0/s1
NCI pathway
Reactome pathway
n/an/a 32n/an/an/an/an/an/a
GlaxoSmithKline
Curated by ChEMBL
Assay Description
Inhibition of PDK1-mediated AKT phosphorylation at Thr308 residue in human PC3 cells by ELISA
J Med Chem 54: 1871-95 (2011)
Article DOI: 10.1021/jm101527u
BindingDB Entry DOI: 10.7270/Q2HQ406Q
Aurora kinase B
(Homo sapiens (Human))
BDBM50418243
(CHEMBL1765732)
Show SMILES Nc1n[nH]c2cc(ccc12)-c1cc(nc(N)n1)N1CCC[C@@H](C1)C(=O)Nc1ccccc1 |r|
Show InChI InChI=1S/C23H24N8O/c24-21-17-9-8-14(11-19(17)29-30-21)18-12-20(28-23(25)27-18)31-10-4-5-15(13-31)22(32)26-16-6-2-1-3-7-16/h1-3,6-9,11-12,15H,4-5,10,13H2,(H,26,32)(H3,24,29,30)(H2,25,27,28)/t15-/m0/s1
Reactome pathway
n/an/a 1.26E+3n/an/an/an/an/an/a
GlaxoSmithKline
Curated by ChEMBL
Assay Description
Inhibition of aurora B
J Med Chem 54: 1871-95 (2011)
Article DOI: 10.1021/jm101527u
BindingDB Entry DOI: 10.7270/Q2HQ406Q
Aurora kinase A
(Homo sapiens (Human))
BDBM50418243
(CHEMBL1765732)
Show SMILES Nc1n[nH]c2cc(ccc12)-c1cc(nc(N)n1)N1CCC[C@@H](C1)C(=O)Nc1ccccc1 |r|
Show InChI InChI=1S/C23H24N8O/c24-21-17-9-8-14(11-19(17)29-30-21)18-12-20(28-23(25)27-18)31-10-4-5-15(13-31)22(32)26-16-6-2-1-3-7-16/h1-3,6-9,11-12,15H,4-5,10,13H2,(H,26,32)(H3,24,29,30)(H2,25,27,28)/t15-/m0/s1
NCI pathway
Reactome pathway
n/an/a 7.94E+3n/an/an/an/an/an/a
GlaxoSmithKline
Curated by ChEMBL
Assay Description
Inhibition of aurora A
J Med Chem 54: 1871-95 (2011)
Article DOI: 10.1021/jm101527u
BindingDB Entry DOI: 10.7270/Q2HQ406Q