BDBM50418323 CHEMBL1765964
SMILES: CCCCCCC1=C(c2ccccc2)[C@@]2(C[C@H](O)C[C@@H]2C1)C(=C)c1ccccc1
InChI Key: InChIKey=BISTUQHMVLSHNR-REUBFRLUSA-N
Data: 2 EC50
Activity Spreadsheet -- Enzyme Inhibition Constant Data from BindingDB
Found 2 hits for monomerid = 50418323
Trg + Lig
Ki
nM
ΔG°
kcal/mole
IC50
nM
Kd
nM
EC50/IC50
nM
koff
s-1
kon
M-1s-1
pHTemp
°C
Liver Receptor Homolog 1
(Homo sapiens (Human))
BDBM50418323
(CHEMBL1765964)
Show SMILES CCCCCCC1=C(c2ccccc2)[C@@]2(C[C@H](O)C[C@@H]2C1)C(=C)c1ccccc1 |r,c:6|
Show InChI InChI=1S/C28H34O/c1-3-4-5-8-17-24-18-25-19-26(29)20-28(25,21(2)22-13-9-6-10-14-22)27(24)23-15-11-7-12-16-23/h6-7,9-16,25-26,29H,2-5,8,17-20H2,1H3/t25-,26+,28-/m0/s1
Reactome pathway
n/an/an/an/a 1.58E+3n/an/an/an/a
University of Southampton
Curated by ChEMBL
Assay Description
Agonist activity at human LRH-1 receptor assessed as TIF2 737-757 peptide recruitment by TR-FRET assay relative to control
J Med Chem 54: 2266-81 (2011)
Article DOI: 10.1021/jm1014296
BindingDB Entry DOI: 10.7270/Q29Z957P
Steroidogenic Factor 1
(Homo sapiens (Human))
BDBM50418323
(CHEMBL1765964)
Show SMILES CCCCCCC1=C(c2ccccc2)[C@@]2(C[C@H](O)C[C@@H]2C1)C(=C)c1ccccc1 |r,c:6|
Show InChI InChI=1S/C28H34O/c1-3-4-5-8-17-24-18-25-19-26(29)20-28(25,21(2)22-13-9-6-10-14-22)27(24)23-15-11-7-12-16-23/h6-7,9-16,25-26,29H,2-5,8,17-20H2,1H3/t25-,26+,28-/m0/s1
Reactome pathway
n/an/an/an/a 316n/an/an/an/a
University of Southampton
Curated by ChEMBL
Assay Description
Agonist activity at human SF-1 assessed as DAX1 1-23 peptide recruitment by TR-FRET assay relative to control
J Med Chem 54: 2266-81 (2011)
Article DOI: 10.1021/jm1014296
BindingDB Entry DOI: 10.7270/Q29Z957P