BDBM50418352 CHEMBL1770466
SMILES: CSCCC(NC(=O)c1ccccc1)c1nc2ccccc2[nH]1
InChI Key: InChIKey=DREAIVKRFXPKRY-UHFFFAOYSA-N
Data: 1 IC50
Activity Spreadsheet -- Enzyme Inhibition Constant Data from BindingDB
Found 1 hit for monomerid = 50418352
Trg + Lig
Ki
nM
ΔG°
kcal/mole
IC50
nM
Kd
nM
EC50/IC50
nM
koff
s-1
kon
M-1s-1
pHTemp
°C
fMet-Leu-Phe receptor
(Homo sapiens (Human))
BDBM50418352
(CHEMBL1770466)
Show SMILES CSCCC(NC(=O)c1ccccc1)c1nc2ccccc2[nH]1
Show InChI InChI=1S/C18H19N3OS/c1-23-12-11-16(21-18(22)13-7-3-2-4-8-13)17-19-14-9-5-6-10-15(14)20-17/h2-10,16H,11-12H2,1H3,(H,19,20)(H,21,22)
Reactome pathway
n/an/a 5.01E+3n/an/an/an/an/an/a
AstraZeneca
Curated by ChEMBL
Assay Description
Intrinsic activity at FPR1 in human neutrophils assessed as increase in calcium mobilization by FLIPR assay relative to fMLF
Bioorg Med Chem Lett 21: 2991-7 (2011)
Article DOI: 10.1016/j.bmcl.2011.03.049
BindingDB Entry DOI: 10.7270/Q2PZ5B2D