BDBM50418800 CHEMBL1797395
SMILES: CCc1onc(c1NC(=O)OCc1c(F)cccc1Cl)-c1c(Cl)cccc1Cl
InChI Key: InChIKey=ROTJCNMAIOYHGG-UHFFFAOYSA-N
Data: 2 IC50
Activity Spreadsheet -- Enzyme Inhibition Constant Data from BindingDB
Found 2 hits for monomerid = 50418800
Trg + Lig
Ki
nM
ΔG°
kcal/mole
IC50
nM
Kd
nM
EC50/IC50
nM
koff
s-1
kon
M-1s-1
pHTemp
°C
Sodium channel protein type 9 subunit alpha
(Homo sapiens (Human))
BDBM50418800
(CHEMBL1797395)
Show SMILES CCc1onc(c1NC(=O)OCc1c(F)cccc1Cl)-c1c(Cl)cccc1Cl |(12.19,-25.21,;12.82,-26.62,;11.92,-27.87,;10.38,-27.87,;9.9,-29.34,;11.15,-30.25,;12.4,-29.33,;13.86,-29.8,;15.18,-29.01,;15.16,-27.47,;16.53,-29.75,;17.85,-28.96,;19.2,-29.71,;19.21,-31.24,;17.89,-32.03,;20.56,-31.99,;21.88,-31.2,;21.85,-29.65,;20.5,-28.91,;20.47,-27.37,;11.16,-31.79,;9.83,-32.56,;8.49,-31.79,;9.83,-34.1,;11.16,-34.87,;12.5,-34.1,;12.49,-32.55,;13.82,-31.78,)|
Show InChI InChI=1S/C19H14Cl3FN2O3/c1-2-15-17(18(25-28-15)16-12(21)6-3-7-13(16)22)24-19(26)27-9-10-11(20)5-4-8-14(10)23/h3-8H,2,9H2,1H3,(H,24,26)
n/an/a 9.33n/an/an/an/an/an/a
AstraZeneca
Curated by ChEMBL
Assay Description
Inhibition of Nav1.7 by cell based whole-cell voltage clamp electrophysiology assay
Bioorg Med Chem Lett 21: 3871-6 (2011)
Article DOI: 10.1016/j.bmcl.2011.05.041
BindingDB Entry DOI: 10.7270/Q21837RK
Sodium channel protein type 5 subunit alpha
(Homo sapiens (Human))
BDBM50418800
(CHEMBL1797395)
Show SMILES CCc1onc(c1NC(=O)OCc1c(F)cccc1Cl)-c1c(Cl)cccc1Cl |(12.19,-25.21,;12.82,-26.62,;11.92,-27.87,;10.38,-27.87,;9.9,-29.34,;11.15,-30.25,;12.4,-29.33,;13.86,-29.8,;15.18,-29.01,;15.16,-27.47,;16.53,-29.75,;17.85,-28.96,;19.2,-29.71,;19.21,-31.24,;17.89,-32.03,;20.56,-31.99,;21.88,-31.2,;21.85,-29.65,;20.5,-28.91,;20.47,-27.37,;11.16,-31.79,;9.83,-32.56,;8.49,-31.79,;9.83,-34.1,;11.16,-34.87,;12.5,-34.1,;12.49,-32.55,;13.82,-31.78,)|
Show InChI InChI=1S/C19H14Cl3FN2O3/c1-2-15-17(18(25-28-15)16-12(21)6-3-7-13(16)22)24-19(26)27-9-10-11(20)5-4-8-14(10)23/h3-8H,2,9H2,1H3,(H,24,26)
n/an/a 7.24E+3n/an/an/an/an/an/a
AstraZeneca
Curated by ChEMBL
Assay Description
Inhibition of Nav1.5 by cell based whole-cell voltage clamp electrophysiology assay
Bioorg Med Chem Lett 21: 3871-6 (2011)
Article DOI: 10.1016/j.bmcl.2011.05.041
BindingDB Entry DOI: 10.7270/Q21837RK