BDBM50419070 CHEMBL1823881
SMILES: CCOc1ccccc1C(=O)NCC1(CCCCC1)N1CCN(CC1)C1CCCC1
InChI Key: InChIKey=JHYUXYFUZXQBNW-UHFFFAOYSA-N
Data: 2 IC50
Activity Spreadsheet -- Enzyme Inhibition Constant Data from BindingDB
Found 2 hits for monomerid = 50419070
Trg + Lig
Ki
nM
ΔG°
kcal/mole
IC50
nM
Kd
nM
EC50/IC50
nM
koff
s-1
kon
M-1s-1
pHTemp
°C
Potassium/sodium hyperpolarization-activated cyclic nucleotide-gated channel 4
(Homo sapiens (Human))
BDBM50419070
(CHEMBL1823881)
Show SMILES CCOc1ccccc1C(=O)NCC1(CCCCC1)N1CCN(CC1)C1CCCC1
Show InChI InChI=1S/C25H39N3O2/c1-2-30-23-13-7-6-12-22(23)24(29)26-20-25(14-8-3-9-15-25)28-18-16-27(17-19-28)21-10-4-5-11-21/h6-7,12-13,21H,2-5,8-11,14-20H2,1H3,(H,26,29)
Reactome pathway
n/an/a 794n/an/an/an/an/an/a
Johnson& Johnson Pharmaceutical Research& Development
Curated by ChEMBL
Assay Description
Inhibition of human HCN4 heterologously expressed in HEK-293 cells after 30 mins by VIPR assay
Bioorg Med Chem Lett 21: 5197-201 (2011)
Article DOI: 10.1016/j.bmcl.2011.07.051
BindingDB Entry DOI: 10.7270/Q2PV6MNP
Potassium/sodium hyperpolarization-activated cyclic nucleotide-gated channel 1
(Homo sapiens (Human))
BDBM50419070
(CHEMBL1823881)
Show SMILES CCOc1ccccc1C(=O)NCC1(CCCCC1)N1CCN(CC1)C1CCCC1
Show InChI InChI=1S/C25H39N3O2/c1-2-30-23-13-7-6-12-22(23)24(29)26-20-25(14-8-3-9-15-25)28-18-16-27(17-19-28)21-10-4-5-11-21/h6-7,12-13,21H,2-5,8-11,14-20H2,1H3,(H,26,29)
Reactome pathway
n/an/a 200n/an/an/an/an/an/a
Johnson& Johnson Pharmaceutical Research& Development
Curated by ChEMBL
Assay Description
Inhibition of human HCN1 heterologously expressed in HEK-293 cells after 30 mins by VIPR assay
Bioorg Med Chem Lett 21: 5197-201 (2011)
Article DOI: 10.1016/j.bmcl.2011.07.051
BindingDB Entry DOI: 10.7270/Q2PV6MNP