BDBM50419073 CHEMBL1823884
SMILES: CCOc1ccccc1C(=O)NCC1(CCCCC1)N1CCN(CC1)c1ccccc1
InChI Key: InChIKey=QLUDDTVPEHHTBK-UHFFFAOYSA-N
Data: 2 IC50
Activity Spreadsheet -- Enzyme Inhibition Constant Data from BindingDB
Found 2 hits for monomerid = 50419073
Trg + Lig
Ki
nM
ΔG°
kcal/mole
IC50
nM
Kd
nM
EC50/IC50
nM
koff
s-1
kon
M-1s-1
pHTemp
°C
Potassium/sodium hyperpolarization-activated cyclic nucleotide-gated channel 4
(Homo sapiens (Human))
BDBM50419073
(CHEMBL1823884)
Show SMILES CCOc1ccccc1C(=O)NCC1(CCCCC1)N1CCN(CC1)c1ccccc1
Show InChI InChI=1S/C26H35N3O2/c1-2-31-24-14-8-7-13-23(24)25(30)27-21-26(15-9-4-10-16-26)29-19-17-28(18-20-29)22-11-5-3-6-12-22/h3,5-8,11-14H,2,4,9-10,15-21H2,1H3,(H,27,30)
Reactome pathway
n/an/a 1.00E+5n/an/an/an/an/an/a
Johnson& Johnson Pharmaceutical Research& Development
Curated by ChEMBL
Assay Description
Inhibition of human HCN4 heterologously expressed in HEK-293 cells after 30 mins by VIPR assay
Bioorg Med Chem Lett 21: 5197-201 (2011)
Article DOI: 10.1016/j.bmcl.2011.07.051
BindingDB Entry DOI: 10.7270/Q2PV6MNP
Potassium/sodium hyperpolarization-activated cyclic nucleotide-gated channel 1
(Homo sapiens (Human))
BDBM50419073
(CHEMBL1823884)
Show SMILES CCOc1ccccc1C(=O)NCC1(CCCCC1)N1CCN(CC1)c1ccccc1
Show InChI InChI=1S/C26H35N3O2/c1-2-31-24-14-8-7-13-23(24)25(30)27-21-26(15-9-4-10-16-26)29-19-17-28(18-20-29)22-11-5-3-6-12-22/h3,5-8,11-14H,2,4,9-10,15-21H2,1H3,(H,27,30)
Reactome pathway
n/an/a>2.00E+5n/an/an/an/an/an/a
Johnson& Johnson Pharmaceutical Research& Development
Curated by ChEMBL
Assay Description
Inhibition of human HCN1 heterologously expressed in HEK-293 cells after 30 mins by VIPR assay
Bioorg Med Chem Lett 21: 5197-201 (2011)
Article DOI: 10.1016/j.bmcl.2011.07.051
BindingDB Entry DOI: 10.7270/Q2PV6MNP