BDBM50419253 CHEMBL1835061
SMILES: Cc1cccc(Nc2nc(NC[C@@H]3CCCN3)ncc2C(N)=O)c1
InChI Key: InChIKey=BWYGQPPOOUSMRI-ZDUSSCGKSA-N
Data: 4 IC50
Activity Spreadsheet -- Enzyme Inhibition Constant Data from BindingDB
Found 4 hits for monomerid = 50419253
Trg + Lig
Ki
nM
ΔG°
kcal/mole
IC50
nM
Kd
nM
EC50/IC50
nM
koff
s-1
kon
M-1s-1
pHTemp
°C
Mitogen-activated protein kinase; ERK1/ERK2
(Homo sapiens (Human))
BDBM50419253
(CHEMBL1835061)
Show SMILES Cc1cccc(Nc2nc(NC[C@@H]3CCCN3)ncc2C(N)=O)c1 |r|
Show InChI InChI=1S/C17H22N6O/c1-11-4-2-5-12(8-11)22-16-14(15(18)24)10-21-17(23-16)20-9-13-6-3-7-19-13/h2,4-5,8,10,13,19H,3,6-7,9H2,1H3,(H2,18,24)(H2,20,21,22,23)/t13-/m0/s1
NCI pathway
Reactome pathway
n/an/a 200n/an/an/an/an/an/a
GlaxoSmithKline R&D
Curated by ChEMBL
Assay Description
Inhibition of Erk1/2 phosphorylation expressed in ramos cells after 30 mins by MSD assay
Bioorg Med Chem Lett 21: 6188-94 (2011)
Article DOI: 10.1016/j.bmcl.2011.07.082
BindingDB Entry DOI: 10.7270/Q2XD12ZW
Potassium voltage-gated channel subfamily H member 2
(Homo sapiens (Human))
BDBM50419253
(CHEMBL1835061)
Show SMILES Cc1cccc(Nc2nc(NC[C@@H]3CCCN3)ncc2C(N)=O)c1 |r|
Show InChI InChI=1S/C17H22N6O/c1-11-4-2-5-12(8-11)22-16-14(15(18)24)10-21-17(23-16)20-9-13-6-3-7-19-13/h2,4-5,8,10,13,19H,3,6-7,9H2,1H3,(H2,18,24)(H2,20,21,22,23)/t13-/m0/s1
Reactome pathway
n/an/a 1.00E+3n/an/an/an/an/an/a
GlaxoSmithKline R&D
Curated by ChEMBL
Assay Description
Inhibition of human ERG expressed in CHO-K1 cells after 2 hrs by Cy3b-Dofetilide-based fluorescence polarisation assay
Bioorg Med Chem Lett 21: 6188-94 (2011)
Article DOI: 10.1016/j.bmcl.2011.07.082
BindingDB Entry DOI: 10.7270/Q2XD12ZW
Tyrosine-protein kinase SYK
(Homo sapiens (Human))
BDBM50419253
(CHEMBL1835061)
Show SMILES Cc1cccc(Nc2nc(NC[C@@H]3CCCN3)ncc2C(N)=O)c1 |r|
Show InChI InChI=1S/C17H22N6O/c1-11-4-2-5-12(8-11)22-16-14(15(18)24)10-21-17(23-16)20-9-13-6-3-7-19-13/h2,4-5,8,10,13,19H,3,6-7,9H2,1H3,(H2,18,24)(H2,20,21,22,23)/t13-/m0/s1
NCI pathway
Reactome pathway
n/an/a 126n/an/an/an/an/an/a
GlaxoSmithKline R&D
Curated by ChEMBL
Assay Description
Inhibition of human full-length recombinant 6His-SYK assessed as phosphorylation of Biotin-AAAEEIYGEI substrate after 60 mins by by TR-FRET assay
Bioorg Med Chem Lett 21: 6188-94 (2011)
Article DOI: 10.1016/j.bmcl.2011.07.082
BindingDB Entry DOI: 10.7270/Q2XD12ZW
Aurora kinase B
(Homo sapiens (Human))
BDBM50419253
(CHEMBL1835061)
Show SMILES Cc1cccc(Nc2nc(NC[C@@H]3CCCN3)ncc2C(N)=O)c1 |r|
Show InChI InChI=1S/C17H22N6O/c1-11-4-2-5-12(8-11)22-16-14(15(18)24)10-21-17(23-16)20-9-13-6-3-7-19-13/h2,4-5,8,10,13,19H,3,6-7,9H2,1H3,(H2,18,24)(H2,20,21,22,23)/t13-/m0/s1
Reactome pathway
n/an/a 6.31E+3n/an/an/an/an/an/a
GlaxoSmithKline R&D
Curated by ChEMBL
Assay Description
Inhibition of human recombinant Flag-6His-Thr-tagged Aurora B assessed as phosphorylation of 5FAM-PKA-tide substrate after 150 mins by fuorescence po...
Bioorg Med Chem Lett 21: 6188-94 (2011)
Article DOI: 10.1016/j.bmcl.2011.07.082
BindingDB Entry DOI: 10.7270/Q2XD12ZW