BDBM50419379 CHEMBL1916280
SMILES: CCC(C)NC(=O)c1c(C)nn(c1NS(=O)(=O)c1ccc(C)cc1)-c1ccccc1
InChI Key: InChIKey=WFJBUKXLKMXFQU-UHFFFAOYSA-N
Data: 1 IC50
Activity Spreadsheet -- Enzyme Inhibition Constant Data from BindingDB
Found 1 hit for monomerid = 50419379
Trg + Lig
Ki
nM
ΔG°
kcal/mole
IC50
nM
Kd
nM
EC50/IC50
nM
koff
s-1
kon
M-1s-1
pHTemp
°C
fMet-Leu-Phe receptor
(Homo sapiens (Human))
BDBM50419379
(CHEMBL1916280)
Show SMILES CCC(C)NC(=O)c1c(C)nn(c1NS(=O)(=O)c1ccc(C)cc1)-c1ccccc1
Show InChI InChI=1S/C22H26N4O3S/c1-5-16(3)23-22(27)20-17(4)24-26(18-9-7-6-8-10-18)21(20)25-30(28,29)19-13-11-15(2)12-14-19/h6-14,16,25H,5H2,1-4H3,(H,23,27)
Reactome pathway
n/an/a 158n/an/an/an/an/an/a
AstraZeneca
Curated by ChEMBL
Assay Description
Antagonist activity at human FPR1 in human neutrophils assessed as inhibition of fMLF-stimulated intracellular calcium mobilisation by FLIPR assay
Bioorg Med Chem Lett 21: 6456-60 (2011)
Article DOI: 10.1016/j.bmcl.2011.08.085
BindingDB Entry DOI: 10.7270/Q2WD41VZ