BDBM50419380 CHEMBL1916283
SMILES: C[C@@H](NC(=O)c1c(C)nn(c1NS(=O)(=O)c1ccc(C)cc1)-c1ccccc1)C(C)(C)C
InChI Key: InChIKey=MYHHDENZOVCZAX-GOSISDBHSA-N
Data: 1 IC50
Activity Spreadsheet -- Enzyme Inhibition Constant Data from BindingDB
Found 1 hit for monomerid = 50419380
Trg + Lig
Ki
nM
ΔG°
kcal/mole
IC50
nM
Kd
nM
EC50/IC50
nM
koff
s-1
kon
M-1s-1
pHTemp
°C
fMet-Leu-Phe receptor
(Homo sapiens (Human))
BDBM50419380
(CHEMBL1916283)
Show SMILES C[C@@H](NC(=O)c1c(C)nn(c1NS(=O)(=O)c1ccc(C)cc1)-c1ccccc1)C(C)(C)C |r|
Show InChI InChI=1S/C24H30N4O3S/c1-16-12-14-20(15-13-16)32(30,31)27-22-21(23(29)25-18(3)24(4,5)6)17(2)26-28(22)19-10-8-7-9-11-19/h7-15,18,27H,1-6H3,(H,25,29)/t18-/m1/s1
Reactome pathway
n/an/a 501n/an/an/an/an/an/a
AstraZeneca
Curated by ChEMBL
Assay Description
Antagonist activity at human FPR1 in human neutrophils assessed as inhibition of fMLF-stimulated intracellular calcium mobilisation by FLIPR assay
Bioorg Med Chem Lett 21: 6456-60 (2011)
Article DOI: 10.1016/j.bmcl.2011.08.085
BindingDB Entry DOI: 10.7270/Q2WD41VZ