BDBM50419411 CHEMBL1915012
SMILES: CC(C)c1cc2cc(Cl)cc(Cn3nc(cc3C)C(O)=O)c2o1
InChI Key: InChIKey=MJUSLUQFEHEIHA-UHFFFAOYSA-N
Data: 2 KI  1 IC50
Activity Spreadsheet -- Enzyme Inhibition Constant Data from BindingDB
Found 3 hits for monomerid = 50419411
Trg + Lig
Ki
nM
ΔG°
kcal/mole
IC50
nM
Kd
nM
EC50/IC50
nM
koff
s-1
kon
M-1s-1
pHTemp
°C
Prostaglandin E2 receptor EP1 subtype (EP1)
(Homo sapiens (Human))
BDBM50419411
(CHEMBL1915012)
Show SMILES CC(C)c1cc2cc(Cl)cc(Cn3nc(cc3C)C(O)=O)c2o1
Show InChI InChI=1S/C17H17ClN2O3/c1-9(2)15-7-11-5-13(18)6-12(16(11)23-15)8-20-10(3)4-14(19-20)17(21)22/h4-7,9H,8H2,1-3H3,(H,21,22)
0.398n/an/an/an/an/an/an/an/a
GlaxoSmithKline
Curated by ChEMBL
Assay Description
Antagonist activity at human recombinant EP1 receptor expressed in CHO-K1 cells assessed as inhibition of PGE2-mediated intracellular calcium mobiliz...
Bioorg Med Chem Lett 21: 4343-8 (2011)
Article DOI: 10.1016/j.bmcl.2011.05.047
BindingDB Entry DOI: 10.7270/Q2RN394N
Prostaglandin E2 receptor
(Homo sapiens (Human))
BDBM50419411
(CHEMBL1915012)
Show SMILES CC(C)c1cc2cc(Cl)cc(Cn3nc(cc3C)C(O)=O)c2o1
Show InChI InChI=1S/C17H17ClN2O3/c1-9(2)15-7-11-5-13(18)6-12(16(11)23-15)8-20-10(3)4-14(19-20)17(21)22/h4-7,9H,8H2,1-3H3,(H,21,22)
1.00E+3n/an/an/an/an/an/an/an/a
GlaxoSmithKline
Curated by ChEMBL
Assay Description
Antagonist activity at human recombinant EP3 receptor expressed in CHO-K1 cells assessed as inhibition of PGE2-mediated intracellular calcium mobiliz...
Bioorg Med Chem Lett 21: 4343-8 (2011)
Article DOI: 10.1016/j.bmcl.2011.05.047
BindingDB Entry DOI: 10.7270/Q2RN394N
Prostaglandin E2 receptor EP1 subtype (EP1)
(Homo sapiens (Human))
BDBM50419411
(CHEMBL1915012)
Show SMILES CC(C)c1cc2cc(Cl)cc(Cn3nc(cc3C)C(O)=O)c2o1
Show InChI InChI=1S/C17H17ClN2O3/c1-9(2)15-7-11-5-13(18)6-12(16(11)23-15)8-20-10(3)4-14(19-20)17(21)22/h4-7,9H,8H2,1-3H3,(H,21,22)
n/an/a 5.01n/an/an/an/an/an/a
GlaxoSmithKline
Curated by ChEMBL
Assay Description
Displacement of [3H]PGE2 from human prostanoid EP1 receptor expressed in CHO-K1 cells after 30 mins by topcount liquid scintillation counting
Bioorg Med Chem Lett 21: 4343-8 (2011)
Article DOI: 10.1016/j.bmcl.2011.05.047
BindingDB Entry DOI: 10.7270/Q2RN394N