BDBM50419565 CHEMBL1934418
SMILES: C[C@H](NC(=O)c1c(C)nn(C2CCSCC2)c1NS(=O)(=O)c1ccc(C)cc1)C(C)(C)C
InChI Key: InChIKey=CMBDQWHWALXRNJ-KRWDZBQOSA-N
Data: 1 IC50
Activity Spreadsheet -- Enzyme Inhibition Constant Data from BindingDB
Found 1 hit for monomerid = 50419565
Trg + Lig
Ki
nM
ΔG°
kcal/mole
IC50
nM
Kd
nM
EC50/IC50
nM
koff
s-1
kon
M-1s-1
pHTemp
°C
fMet-Leu-Phe receptor
(Homo sapiens (Human))
BDBM50419565
(CHEMBL1934418)
Show SMILES C[C@H](NC(=O)c1c(C)nn(C2CCSCC2)c1NS(=O)(=O)c1ccc(C)cc1)C(C)(C)C |r|
Show InChI InChI=1S/C23H34N4O3S2/c1-15-7-9-19(10-8-15)32(29,30)26-21-20(22(28)24-17(3)23(4,5)6)16(2)25-27(21)18-11-13-31-14-12-18/h7-10,17-18,26H,11-14H2,1-6H3,(H,24,28)/t17-/m0/s1
Reactome pathway
n/an/a 40n/an/an/an/an/an/a
AstraZeneca
Curated by ChEMBL
Assay Description
Antagonist activity at human recombinant FPR1 in expressed in HEK293 cells assessed as inhibition of FMLP-stimulated intracellular calcium mobilisati...
Bioorg Med Chem Lett 22: 532-6 (2011)
Article DOI: 10.1016/j.bmcl.2011.10.090
BindingDB Entry DOI: 10.7270/Q27P90NM