BDBM50419569 CHEMBL1934413
SMILES: C[C@H](NC(=O)c1c(C)nn(C2CCC2)c1NS(=O)(=O)c1ccc(C)cc1)C(C)(C)C
InChI Key: InChIKey=DPTNZCSNVMOOAE-INIZCTEOSA-N
Data: 1 IC50
Activity Spreadsheet -- Enzyme Inhibition Constant Data from BindingDB
Found 1 hit for monomerid = 50419569
Trg + Lig
Ki
nM
ΔG°
kcal/mole
IC50
nM
Kd
nM
EC50/IC50
nM
koff
s-1
kon
M-1s-1
pHTemp
°C
fMet-Leu-Phe receptor
(Homo sapiens (Human))
BDBM50419569
(CHEMBL1934413)
Show SMILES C[C@H](NC(=O)c1c(C)nn(C2CCC2)c1NS(=O)(=O)c1ccc(C)cc1)C(C)(C)C |r|
Show InChI InChI=1S/C22H32N4O3S/c1-14-10-12-18(13-11-14)30(28,29)25-20-19(21(27)23-16(3)22(4,5)6)15(2)24-26(20)17-8-7-9-17/h10-13,16-17,25H,7-9H2,1-6H3,(H,23,27)/t16-/m0/s1
Reactome pathway
n/an/a 200n/an/an/an/an/an/a
AstraZeneca
Curated by ChEMBL
Assay Description
Antagonist activity at human recombinant FPR1 in expressed in HEK293 cells assessed as inhibition of FMLP-stimulated intracellular calcium mobilisati...
Bioorg Med Chem Lett 22: 532-6 (2011)
Article DOI: 10.1016/j.bmcl.2011.10.090
BindingDB Entry DOI: 10.7270/Q27P90NM