BDBM50419678 CHEMBL1945036
SMILES: CC(CNCc1ccc(CCNC[C@H](O)c2ccc(O)c3[nH]c(=O)sc23)cc1)c1ccccc1
InChI Key: InChIKey=ZLXIUIBLWYKVOG-LUTIACGYSA-N
Data: 4 IC50  1 EC50
Activity Spreadsheet -- Enzyme Inhibition Constant Data from BindingDB
Found 5 hits for monomerid = 50419678
Trg + Lig
Ki
nM
ΔG°
kcal/mole
IC50
nM
Kd
nM
EC50/IC50
nM
koff
s-1
kon
M-1s-1
pHTemp
°C
Beta-2 adrenergic receptor
(Homo sapiens (Human))
BDBM50419678
(CHEMBL1945036)
Show SMILES CC(CNCc1ccc(CCNC[C@H](O)c2ccc(O)c3[nH]c(=O)sc23)cc1)c1ccccc1 |r|
Show InChI InChI=1S/C27H31N3O3S/c1-18(21-5-3-2-4-6-21)15-29-16-20-9-7-19(8-10-20)13-14-28-17-24(32)22-11-12-23(31)25-26(22)34-27(33)30-25/h2-12,18,24,28-29,31-32H,13-17H2,1H3,(H,30,33)/t18?,24-/m0/s1
Reactome pathway
n/an/a 0.200n/an/an/an/an/an/a
AstraZeneca
Curated by ChEMBL
Assay Description
Displacement of radiolabeled iodocyanopindolol from recombinant beta2 adrenoceptor
Bioorg Med Chem Lett 22: 689-95 (2011)
Article DOI: 10.1016/j.bmcl.2011.10.049
BindingDB Entry DOI: 10.7270/Q2KW5H90
Beta-2 adrenergic receptor
(Homo sapiens (Human))
BDBM50419678
(CHEMBL1945036)
Show SMILES CC(CNCc1ccc(CCNC[C@H](O)c2ccc(O)c3[nH]c(=O)sc23)cc1)c1ccccc1 |r|
Show InChI InChI=1S/C27H31N3O3S/c1-18(21-5-3-2-4-6-21)15-29-16-20-9-7-19(8-10-20)13-14-28-17-24(32)22-11-12-23(31)25-26(22)34-27(33)30-25/h2-12,18,24,28-29,31-32H,13-17H2,1H3,(H,30,33)/t18?,24-/m0/s1
Reactome pathway
n/an/an/an/a 0.398n/an/an/an/a
AstraZeneca
Curated by ChEMBL
Assay Description
Agonist activity at human beta2 adrenoceptor expressed in H292 cells assessed as increase in cAMP accumulation after 60 mins by spectrophotometry
Bioorg Med Chem Lett 22: 689-95 (2011)
Article DOI: 10.1016/j.bmcl.2011.10.049
BindingDB Entry DOI: 10.7270/Q2KW5H90
Beta-1 adrenergic receptor
(Homo sapiens (Human))
BDBM50419678
(CHEMBL1945036)
Show SMILES CC(CNCc1ccc(CCNC[C@H](O)c2ccc(O)c3[nH]c(=O)sc23)cc1)c1ccccc1 |r|
Show InChI InChI=1S/C27H31N3O3S/c1-18(21-5-3-2-4-6-21)15-29-16-20-9-7-19(8-10-20)13-14-28-17-24(32)22-11-12-23(31)25-26(22)34-27(33)30-25/h2-12,18,24,28-29,31-32H,13-17H2,1H3,(H,30,33)/t18?,24-/m0/s1
Reactome pathway
n/an/a 501n/an/an/an/an/an/a
AstraZeneca
Curated by ChEMBL
Assay Description
Displacement of radiolabeled iodocyanopindolol from beta1 adrenoceptor
Bioorg Med Chem Lett 22: 689-95 (2011)
Article DOI: 10.1016/j.bmcl.2011.10.049
BindingDB Entry DOI: 10.7270/Q2KW5H90
Alpha-1D adrenergic receptor
(Homo sapiens (Human))
BDBM50419678
(CHEMBL1945036)
Show SMILES CC(CNCc1ccc(CCNC[C@H](O)c2ccc(O)c3[nH]c(=O)sc23)cc1)c1ccccc1 |r|
Show InChI InChI=1S/C27H31N3O3S/c1-18(21-5-3-2-4-6-21)15-29-16-20-9-7-19(8-10-20)13-14-28-17-24(32)22-11-12-23(31)25-26(22)34-27(33)30-25/h2-12,18,24,28-29,31-32H,13-17H2,1H3,(H,30,33)/t18?,24-/m0/s1
Reactome pathway
n/an/a 32n/an/an/an/an/an/a
AstraZeneca
Curated by ChEMBL
Assay Description
Binding affinity to Alpha-1D adrenoceptor expressed in HEK cells by calcium flux assay
Bioorg Med Chem Lett 22: 689-95 (2011)
Article DOI: 10.1016/j.bmcl.2011.10.049
BindingDB Entry DOI: 10.7270/Q2KW5H90
D(2) dopamine receptor
(Homo sapiens (Human))
BDBM50419678
(CHEMBL1945036)
Show SMILES CC(CNCc1ccc(CCNC[C@H](O)c2ccc(O)c3[nH]c(=O)sc23)cc1)c1ccccc1 |r|
Show InChI InChI=1S/C27H31N3O3S/c1-18(21-5-3-2-4-6-21)15-29-16-20-9-7-19(8-10-20)13-14-28-17-24(32)22-11-12-23(31)25-26(22)34-27(33)30-25/h2-12,18,24,28-29,31-32H,13-17H2,1H3,(H,30,33)/t18?,24-/m0/s1
Reactome pathway
n/an/a 2.51E+3n/an/an/an/an/an/a
AstraZeneca
Curated by ChEMBL
Assay Description
Binding affinity to dopamine D2 receptor expressed in HEK cells by GTPgammaS binding assay
Bioorg Med Chem Lett 22: 689-95 (2011)
Article DOI: 10.1016/j.bmcl.2011.10.049
BindingDB Entry DOI: 10.7270/Q2KW5H90