BDBM50419993 CHEMBL2018317
SMILES: CC(C)Oc1ccc(cc1Cl)-c1nc(no1)-c1cccc2c(CC(O)=O)c[nH]c12
InChI Key: InChIKey=HPWRAENLHHTNRS-UHFFFAOYSA-N
Data: 2 EC50
Activity Spreadsheet -- Enzyme Inhibition Constant Data from BindingDB
Found 2 hits for monomerid = 50419993
Trg + Lig
Ki
nM
ΔG°
kcal/mole
IC50
nM
Kd
nM
EC50/IC50
nM
koff
s-1
kon
M-1s-1
pHTemp
°C
Sphingosine 1-phosphate receptor 3
(Homo sapiens (Human))
BDBM50419993
(CHEMBL2018317)
Show SMILES CC(C)Oc1ccc(cc1Cl)-c1nc(no1)-c1cccc2c(CC(O)=O)c[nH]c12
Show InChI InChI=1S/C21H18ClN3O4/c1-11(2)28-17-7-6-12(8-16(17)22)21-24-20(25-29-21)15-5-3-4-14-13(9-18(26)27)10-23-19(14)15/h3-8,10-11,23H,9H2,1-2H3,(H,26,27)
NCI pathway
Reactome pathway
n/an/an/an/a>1.00E+4n/an/an/an/a
GlaxoSmithKline Pharmaceuticals
Curated by ChEMBL
Assay Description
Agonist activity at human S1P3 receptor assessed as Ca2+ mobilization by GeneBLAzer assay
Bioorg Med Chem Lett 22: 2794-7 (2012)
Article DOI: 10.1016/j.bmcl.2012.02.083
BindingDB Entry DOI: 10.7270/Q29G5P3R
Sphingosine 1-phosphate receptor 1
(Homo sapiens (Human))
BDBM50419993
(CHEMBL2018317)
Show SMILES CC(C)Oc1ccc(cc1Cl)-c1nc(no1)-c1cccc2c(CC(O)=O)c[nH]c12
Show InChI InChI=1S/C21H18ClN3O4/c1-11(2)28-17-7-6-12(8-16(17)22)21-24-20(25-29-21)15-5-3-4-14-13(9-18(26)27)10-23-19(14)15/h3-8,10-11,23H,9H2,1-2H3,(H,26,27)
Reactome pathway
n/an/an/an/a 39.8n/an/an/an/a
GlaxoSmithKline Pharmaceuticals
Curated by ChEMBL
Assay Description
Agonist activity at S1P1 receptor by Tango assay
Bioorg Med Chem Lett 22: 2794-7 (2012)
Article DOI: 10.1016/j.bmcl.2012.02.083
BindingDB Entry DOI: 10.7270/Q29G5P3R